{"text_format":"1","workbook":"xlsx","n_sheets":10,"sheets":["Disclaimer","Cortec","Nomenclature","Date Drivers","Lookup","Master Text","MIFAS Data","Routing","Routing DB","Database"],"not_rendered":{"charts":0,"images":0,"macros":1,"external_links":0,"defined_names":5,"comments":0,"pivot_tables":0},"unopened":[],"bounds":{"document_bytes":16777216,"sheet_cells":100000,"rows_first":2000,"rows_last":500,"rows_between":2000,"halvings":0,"cell_chars":16384,"cell_head_chars":4096},"cells_cut":0,"cells_raw":0,"read":"whole","date_system":"1900"}

{"sheet":"Disclaimer","index":0,"n_rows":6,"n_cols":2,"rows_kept":6,"cut":false,"hidden":false,"merged":[[2,1,2,9],[5,1,7,9],[3,1,4,9]]}
[]
[]
[null,"Our policy is one of continuous development. Accordingly the design of our products may change at any time. "]
[null,"Whilst every effort is made to produce up to date literature, this document should only be regarded as a guide and is intended for information purposes only."]
[]
[null,"Its contents do not constitute an offer for sale or advice on the application of any product referred to in it. We cannot be held responsible for any reliance on any decisions taken on its contents without specific advice."]

{"sheet":"Cortec","index":1,"n_rows":39,"n_cols":20,"rows_kept":39,"cut":false,"hidden":false,"merged":[[5,0,5,2],[13,0,13,2],[22,0,22,2]]}
[null,"P991 CORTEC"]
[]
["Issue:"]
["See Model List (Factory Defined)"]
[]
["Cassette #14"]
["ONLY if Cassette #13 is \"C.T. shorted to the cassette below\"","C.T. shorted to the cassette above",9]
["ONLY if Cassette #1 is NOT \"C.T. shorted to the cassette below\"","Stage 1 (first contact to be closed - e.g. trip circuit)","1"]
["ONLY if Cassette #1 is NOT \"C.T. shorted to the cassette below\"","Stage 2 (second contact to be closed - e.g. aux.supply or I/O)","2"]
["ONLY if Cassette #1 is NOT \"C.T. shorted to the cassette below\"","Stage 3 (third contact to be closed - e.g. VT)","3"]
["ONLY if Cassette #1 is NOT \"C.T. shorted to the cassette below\"","Monitoring points (for monitoring I/O without breaking connection to relay)","4"]
["ONLY if Cassette #1 is NOT \"C.T. shorted to the cassette below\"","Blank cassette (for labelling and isolation)","0"]
[]
["Cassette #2 to 13 (inclusive)"]
[null,"C.T. shorted to the cassette below","8"]
["ONLY if Cassette #1 is \"C.T. shorted to the cassette below\"","C.T. shorted to the cassette above","9"]
["ONLY if Cassette #1 is NOT \"C.T. shorted to the cassette below\"","Stage 1 (first contact to be closed - e.g. trip circuit)","1"]
["ONLY if Cassette #1 is NOT \"C.T. shorted to the cassette below\"","Stage 2 (second contact to be closed - e.g. aux.supply or I/O)","2"]
["ONLY if Cassette #1 is NOT \"C.T. shorted to the cassette below\"","Stage 3 (third contact to be closed - e.g. VT)","3"]
["ONLY if Cassette #1 is NOT \"C.T. shorted to the cassette below\"","Monitoring points (for monitoring I/O without breaking connection to relay)","4"]
["ONLY if Cassette #1 is NOT \"C.T. shorted to the cassette below\"","Blank cassette (for labelling and isolation)","0"]
[]
["Cassette #1"]
[null,"C.T. shorted to the cassette below","8"]
[null,"Stage 1 (first contact to be closed - e.g. trip circuit)","1"]
[null,"Stage 2 (second contact to be closed - e.g. aux.supply or I/O)","2"]
[null,"Stage 3 (third contact to be closed - e.g. VT)","3"]
[null,"Monitoring points (for monitoring I/O without breaking connection to relay)","4"]
[null,"Blank cassette (for labelling and isolation)","0"]
[]
["P991 Test Block"]
[]
["For use only with:",null,null,null,"P","*","*","*","*","*","*","*","*","*","*","*","*","*","*","*"]
["P992 Multi Fingered Test Plug"]
["P993 Single Fingered Test Plug"]
["P994 Single Fingered Isolating Plug"]
[]
["Issue:","K"]
["Date:","2016-09-28"]

{"sheet":"Nomenclature","index":2,"n_rows":42,"n_cols":39,"rows_kept":42,"cut":false,"hidden":false,"merged":[[39,2,39,13],[0,0,0,16],[1,1,1,5],[41,3,41,17]]}
["BEFORE Selecting your particular configuration please specify your preferred despatch date to enable us to check for variant availability."]
[null," (Using format dd/mm/yyyy where dd=day, mm=month & yyyy=year)"]
[null,"Despatch date",null,"Despatch date"]
["Cassette","Number","NOMENCLATURE for \"New\" Test Block - P990 Range"]
["position","of"]
["numbered 1 to 14","possible","Select ONE cassette option for each of the 14 positions",null,null,null,null,null,null,null,null,null,null,null,null,null,null,null,null,null,2,3,4,5,6,7,8,9,10,11,12,13,14]
["top to","options","P991 Test Block Model Variant Number:","P",{"$f":"D9","v":2},{"$f":"$D$11","v":2},{"$f":"D13","v":2},{"$f":"D15","v":2},{"$f":"D17","v":2},{"$f":"D19","v":2},{"$f":"D21","v":0},{"$f":"D23","v":0},{"$f":"D25","v":0},{"$f":"D27","v":0},{"$f":"D29","v":0},{"$f":"D31","v":0},{"$f":"D33","v":0},{"$f":"D35","v":0},{"$f":"D37","v":"D"},null,null,null,null,null,null,null,null,null,null,null,null,null,null,null,null,null,null,null,4]
["bottom","listed"]
[1,6,null,{"$f":"VLOOKUP(Lookup!$A$49,Lookup!$B$50:$D$55,3)","v":2}]
[]
[2,{"$f":"HLOOKUP(Lookup!$E$56,Lookup!$D$40:$F$47,8)","v":6},null,{"$f":"VLOOKUP(Lookup!$A$56,Lookup!$B$57:$D$62,3)","v":2}]
[]
[3,{"$f":"HLOOKUP(Lookup!$E$63,Lookup!$G$40:$I$47,8)","v":6},null,{"$f":"VLOOKUP(Lookup!$A$63,Lookup!$B$64:$D$69,3)","v":2}]
[]
[4,{"$f":"HLOOKUP(Lookup!$E$70,Lookup!$G$40:$I$47,8)","v":6},null,{"$f":"VLOOKUP(Lookup!$A$70,Lookup!$B$71:$D$76,3)","v":2}]
[]
[5,{"$f":"HLOOKUP(Lookup!$E$77,Lookup!$G$40:$I$47,8)","v":6},null,{"$f":"VLOOKUP(Lookup!$A$77,Lookup!$B$78:$D$83,3)","v":2}]
[]
[6,{"$f":"HLOOKUP(Lookup!$E$84,Lookup!$G$40:$I$47,8)","v":6},null,{"$f":"VLOOKUP(Lookup!$A$84,Lookup!$B$85:$D$90,3)","v":2}]
[]
[7,{"$f":"HLOOKUP(Lookup!$E$91,Lookup!$G$40:$I$47,8)","v":6},null,{"$f":"VLOOKUP(Lookup!$A$91,Lookup!$B$92:$D$97,3)","v":0}]
[]
[8,{"$f":"HLOOKUP(Lookup!$E$98,Lookup!$G$40:$I$47,8)","v":6},null,{"$f":"VLOOKUP(Lookup!$A$98,Lookup!$B$99:$D$104,3)","v":0}]
[]
[9,{"$f":"HLOOKUP(Lookup!$E$105,Lookup!$G$40:$I$47,8)","v":6},null,{"$f":"VLOOKUP(Lookup!$A$105,Lookup!$B$106:$D$111,3)","v":0}]
[]
[10,{"$f":"HLOOKUP(Lookup!$E$112,Lookup!$G$40:$I$47,8)","v":6},null,{"$f":"VLOOKUP(Lookup!$A$112,Lookup!$B$113:$D$118,3)","v":0}]
[]
[11,{"$f":"HLOOKUP(Lookup!$E$119,Lookup!$G$40:$I$47,8)","v":6},null,{"$f":"VLOOKUP(Lookup!$A$119,Lookup!$B$120:$D$125,3)","v":0}]
[]
[12,{"$f":"HLOOKUP(Lookup!$E$126,Lookup!$G$40:$I$47,8)","v":6},null,{"$f":"VLOOKUP(Lookup!$A$126,Lookup!$B$127:$D$132,3)","v":0}]
[]
[13,{"$f":"HLOOKUP(Lookup!$E$133,Lookup!$G$40:$I$47,8)","v":6},null,{"$f":"VLOOKUP(Lookup!$A$133,Lookup!$B$134:$D$139,3)","v":0}]
[]
[14,{"$f":"HLOOKUP(Lookup!$E$140,Lookup!$J$40:$L$46,7)","v":5},null,{"$f":"VLOOKUP(Lookup!$A$140,Lookup!$B$141:$D$145,3)","v":0}]
[]
[null,null,null,{"$f":"VLOOKUP(Lookup!$A$171,Lookup!$B$172:$D$173,3)","v":"D"}]
[]
[null,null,"Associated Equipment"]
[null,null,"Dedicated design Multiple or Single-finger Test Plugs are required for use with this product: do you wish to order any?"]
[null,2]
[null,{"$f":"VLOOKUP(Lookup!$B$178,Lookup!$B$175:$G$176,6)","v":1},null,{"$f":"VLOOKUP(Lookup!$D$178,Lookup!$B$179:$D$181,3)","v":""}]

{"sheet":"Date Drivers","index":3,"n_rows":57,"n_cols":8,"rows_kept":57,"cut":false,"hidden":true,"merged":[]}
[null,"2001-01-01","2001-04-01","2002-01-08","2002-03-26","2002-09-04","2004-10-19","2005-09-29"]
[1,"First despatch date available : 01/04/2001","C.T. with shorting link to cassette ","C.T. with shorting link to cassette ","C.T. with shorting link to cassette ","C.T. with shorting link to cassette ","C.T. with shorting link to cassette ","C.T. with shorting link to cassette "]
[2," ","Stage 1 (first contact to be made - e.g. trip circuit)","Stage 1 (first contact to be made - e.g. trip circuit)","Stage 1 (first contact to be made - e.g. trip circuit)","Stage 1 (first contact to be made - e.g. trip circuit)","Stage 1 (first contact to be made - e.g. trip circuit)","Stage 1 (first contact to be made - e.g. trip circuit)"]
[3," ","Stage 2 (second contact to be made - e.g. aux.supply or I/O)","Stage 2 (second contact to be made - e.g. aux.supply or I/O)","Stage 2 (second contact to be made - e.g. aux.supply or I/O)","Stage 2 (second contact to be made - e.g. aux.supply or I/O)","Stage 2 (second contact to be made - e.g. aux.supply or I/O)","Stage 2 (second contact to be made - e.g. aux.supply or I/O)"]
[4," ","Stage 3 (third contact to be made - e.g. VT)","Stage 3 (third contact to be made - e.g. VT)","Stage 3 (third contact to be made - e.g. VT)","Stage 3 (third contact to be made - e.g. VT)","Stage 3 (third contact to be made - e.g. VT)","Stage 3 (third contact to be made - e.g. VT)"]
[5," ","Monitoring points (for monitoring I/O without breaking connection to relay)","Monitoring points (for monitoring I/O without breaking connection to relay)","Monitoring points (for monitoring I/O without breaking connection to relay)","Monitoring points (for monitoring I/O without breaking connection to relay)","Monitoring points (for monitoring I/O without breaking connection to relay)","Monitoring points (for monitoring I/O without breaking connection to relay)"]
[6," ","Blank cassette (for labelling and isolation)","Blank cassette (for labelling and isolation)","Blank cassette (for labelling and isolation)","Blank cassette (for labelling and isolation)","Blank cassette (for labelling and isolation)","Blank cassette (for labelling and isolation)"]
[1,"*",8,8,8,8,8,8]
[2,"*",1,1,1,1,1,1]
[3,"*",2,2,2,2,2,2]
[4,"*",3,3,3,3,3,3]
[5,"*",4,4,4,4,4,4]
[6,"*",0,0,0,0,0,0]
["Design Suffix Key",{"$f":"IF(Nomenclature!$C$3=\"\",TODAY(),Nomenclature!$C$3)","v":"2024-01-02"}]
["Design Suffix"," "," ","B","C","C","C","C"]
[null,"Shorting Bars","CT Shorting Bar - 2 Way","CT Shorting Bar - 2 Way","CT Shorting Bar - 2 Way","CT Shorting Bar - 2 Way","CT Shorting Bar - 2 Way","CT Shorting Bar - 2 Way"]
[null,null,"CT Shorting Bar - 3 Way","CT Shorting Bar - 3 Way","CT Shorting Bar - 3 Way","CT Shorting Bar - 3 Way","CT Shorting Bar - 3 Way","CT Shorting Bar - 3 Way"]
[null,null,"CT Shorting Bar - 4 Way","CT Shorting Bar - 4 Way","CT Shorting Bar - 4 Way","CT Shorting Bar - 4 Way","CT Shorting Bar - 4 Way","CT Shorting Bar - 4 Way"]
[null,null,"CT Shorting Bar - 5 Way","CT Shorting Bar - 5 Way","CT Shorting Bar - 5 Way","CT Shorting Bar - 5 Way","CT Shorting Bar - 5 Way","CT Shorting Bar - 5 Way"]
[null,null,"CT Shorting Bar - 6 Way","CT Shorting Bar - 6 Way","CT Shorting Bar - 6 Way","CT Shorting Bar - 6 Way","CT Shorting Bar - 6 Way","CT Shorting Bar - 6 Way"]
[null,null,"CT Shorting Bar - 7 Way","CT Shorting Bar - 7 Way","CT Shorting Bar - 7 Way","CT Shorting Bar - 7 Way","CT Shorting Bar - 7 Way","CT Shorting Bar - 7 Way"]
[null,null,"CT Shorting Bar - 8 Way","CT Shorting Bar - 8 Way","CT Shorting Bar - 8 Way","CT Shorting Bar - 8 Way","CT Shorting Bar - 8 Way","CT Shorting Bar - 8 Way"]
[null,null,"CT Shorting Bar - 9 Way","CT Shorting Bar - 9 Way","CT Shorting Bar - 9 Way","CT Shorting Bar - 9 Way","CT Shorting Bar - 9 Way","CT Shorting Bar - 9 Way"]
[null,null,"CT Shorting Bar - 10 Way","CT Shorting Bar - 10 Way","CT Shorting Bar - 10 Way","CT Shorting Bar - 10 Way","CT Shorting Bar - 10 Way","CT Shorting Bar - 10 Way"]
[null,null,"CT Shorting Bar - 11 Way","CT Shorting Bar - 11 Way","CT Shorting Bar - 11 Way","CT Shorting Bar - 11 Way","CT Shorting Bar - 11 Way","CT Shorting Bar - 11 Way"]
[null,null,"CT Shorting Bar - 12 Way","CT Shorting Bar - 12 Way","CT Shorting Bar - 12 Way","CT Shorting Bar - 12 Way","CT Shorting Bar - 12 Way","CT Shorting Bar - 12 Way"]
[null,null,"CT Shorting Bar - 13 Way","CT Shorting Bar - 13 Way","CT Shorting Bar - 13 Way","CT Shorting Bar - 13 Way","CT Shorting Bar - 13 Way","CT Shorting Bar - 13 Way"]
[null,null,"CT Shorting Bar - 14 Way","CT Shorting Bar - 14 Way","CT Shorting Bar - 14 Way","CT Shorting Bar - 14 Way","CT Shorting Bar - 14 Way","CT Shorting Bar - 14 Way"]
[null,null,"GN2065001","GN2065001","GN2065001","GN2065001","GN2065001","GN2065001"]
[null,null,"GN2065002","GN2065002","GN2065002","GN2065002","GN2065002","GN2065002"]
[null,null,"GN2065003","GN2065003","GN2065003","GN2065003","GN2065003","GN2065003"]
[null,null,"GN2065004","GN2065004","GN2065004","GN2065004","GN2065004","GN2065004"]
[null,null,"GN2065999","GN2065999","GN2065999","GN2065005","GN2065005","GN2065005"]
[null,null,"GN2065999","GN2065999","GN2065999","GN2065006","GN2065006","GN2065006"]
[null,null,"GN2065999","GN2065999","GN2065999","GN2065007","GN2065007","GN2065007"]
[null,null,"GN2065999","GN2065999","GN2065999","GN2065999","GN2065008","GN2065008"]
[null,null,"GN2065999","GN2065999","GN2065999","GN2065999","GN2065009","GN2065009"]
[null,null,"GN2065999","GN2065999","GN2065999","GN2065999","GN2065999","GN2065999"]
[null,null,"GN2065999","GN2065999","GN2065999","GN2065999","GN2065999","GN2065999"]
[null,null,"GN2065999","GN2065999","GN2065999","GN2065999","GN2065999","GN2065999"]
[null,null,"GN2065999","GN2065999","GN2065999","GN2065999","GN2065999","GN2065999"]
[]
[]
[]
[]
[]
[]
[]
[]
[null,null,"No","No","No","No","No","No"]
[null,null,"Yes","Yes","Yes","Yes","Yes","Yes"]
[null,null,"Selection NOT REQUIRED","Selection NOT REQUIRED","Selection NOT REQUIRED","Selection NOT REQUIRED","Selection NOT REQUIRED","Selection NOT REQUIRED"]
[null,null,"Multiple finger test plug (MFTP)","Multiple finger test plug (MFTP)","Multiple finger test plug (MFTP)","Multiple finger test plug (MFTP)","Multiple finger test plug (MFTP)","Multiple finger test plug (MFTP)"]
[null,null,"Single finger test plug (SFTP)","Single finger test plug (SFTP)","Single finger test plug (SFTP)","Single finger test plug (SFTP)","Single finger test plug (SFTP)","Single finger test plug (SFTP)"]
[null,null," "," "," "," ","Single finger isolating plug (SFIP)","Single finger isolating plug (SFIP)"]
[null,null,1,1,1,1,1,1]
[null,null,2,2,2,2,3,3]

{"sheet":"Lookup","index":4,"n_rows":181,"n_cols":12,"rows_kept":181,"cut":false,"hidden":true,"merged":[[139,1,139,3],[48,1,48,3],[104,1,104,3],[111,1,111,3],[118,1,118,3],[125,1,125,3],[76,1,76,3],[83,1,83,3],[90,1,90,3],[132,1,132,3],[18,1,18,2],[1,1,1,2],[29,1,29,2],[7,1,7,2],[97,1,97,3],[55,1,55,3],[62,1,62,3],[69,1,69,3]]}
["Seven possible scenarios exist(of which some may be duplicates):"]
[1,"For the first cassette ALL options EXCEPT \"C.T. shorted to cassette above\" must be offered",null,"Scenario #1",1,"C.T. shorted to the cassette below","0"]
[null,null,null,null,3,"Stage 1 (first contact to be closed - e.g. trip circuit)","2"]
[null,null,null,null,4,"Stage 2 (second contact to be closed - e.g. aux.supply or I/O)","3"]
[null,null,null,null,5,"Stage 3 (third contact to be closed - e.g. VT)","4"]
[null,null,null,null,6,"Monitoring points (for monitoring I/O without breaking connection to relay)","5"]
[null,null,null,null,7,"Blank cassette (for labelling and isolation)","6"]
[2,"For the second cassette there are two possibilities:"]
[null,"a)","Where cassette #1 was a \"C.T. shorted to the cassette below\" type ONLY another \"C.T. shorted to the cassette below\" OR a \"C.T. shorted to the cassette above\" options must be offered","Scenario #2a)",1,"C.T. shorted to the cassette below","0"]
[null,null,null,null,2,"C.T. shorted to the cassette above","1"]
[]
[null,"b)","Where cassette #1 was anything other than a  \"C.T. shorted to the cassette below\" type ALL options must be offered","Scenario #2b)",1,"C.T. shorted to the cassette below","0"]
[null,null,null,null,3,"Stage 1 (first contact to be made - e.g. trip circuit)","2"]
[null,null,null,null,4,"Stage 2 (second contact to be made - e.g. aux.supply or I/O)","3"]
[null,null,null,null,5,"Stage 3 (third contact to be made - e.g. VT)","4"]
[null,null,null,null,6,"Monitoring points (for monitoring I/O without breaking connection to relay)","5"]
[null,null,null,null,7,"Blank cassette (for labelling and isolation)","6"]
[]
[3,"For the third to thirteenth cassettes there are two possibilities:"]
[null,"a)","Where the previous cassette was either a \"C.T. shorted to the cassette below\" OR a \"C.T. shorted to the cassette above\" type EITHER a \"C.T. shorted to the cassette below\" OR a \"C.T. shorted to the cassette above\" options must be offered.","Scenario #3a)",1,"C.T. shorted to the cassette below","0"]
[null,null,null,null,2,"C.T. shorted to the cassette above","1"]
[]
[null,"b)","Where the previous cassette was anything other than a  \"C.T. shorted to the cassette below\" type ALL options EXCEPT \"C.T. shorted to the cassette above\" must be offered","Scenario #3b)",1,"C.T. shorted to the cassette below","0"]
[null,null,null,null,3,"Stage 1 (first contact to be made - e.g. trip circuit)","2"]
[null,null,null,null,4,"Stage 2 (second contact to be made - e.g. aux.supply or I/O)","3"]
[null,null,null,null,5,"Stage 3 (third contact to be made - e.g. VT)","4"]
[null,null,null,null,6,"Monitoring points (for monitoring I/O without breaking connection to relay)","5"]
[null,null,null,null,7,"Blank cassette (for labelling and isolation)","6"]
[]
[4,"For the last cassette there are two possibilities"]
[null,"a)","Where the previous cassette was a \"C.T. shorted to the cassette below\" ONLY a \"C.T. shorted to the cassette above\" option must be offered.","Scenario #4a)",2,"C.T. shorted to the cassette above","1"]
[]
[]
[null,"b)","Where the previous cassette was anything other than a  \"C.T. shorted to the cassette below\" type ALL options EXCEPT \"C.T. shorted to the cassette below\" OR \"C.T. shorted to the cassette above\" must be offered","Scenario #4b)",2,"Stage 1 (first contact to be made - e.g. trip circuit)","2"]
[null,null,null,null,3,"Stage 2 (second contact to be made - e.g. aux.supply or I/O)","3"]
[null,null,null,null,4,"Stage 3 (third contact to be made - e.g. VT)","4"]
[null,null,null,null,5,"Monitoring points (for monitoring I/O without breaking connection to relay)","5"]
[null,null,null,null,6,"Blank cassette (for labelling and isolation)","6"]
[null,null,null,"Lookup array for cassette #2",null,null,"Lookup array for cassette #3-13",null,null,"Lookup array for cassette #14"]
[null,null,null,0,8,9,0,8,9,0,8,9]
[null,null,null,"C.T. shorted to the cassette below","C.T. shorted to the cassette below","C.T. shorted to the cassette below","C.T. shorted to the cassette above","C.T. shorted to the cassette below","C.T. shorted to the cassette above","Stage 1 (first contact to be made - e.g. trip circuit)","C.T. shorted to the cassette above","Stage 1 (first contact to be made - e.g. trip circuit)"]
[null,null,null,"Stage 1 (first contact to be closed - e.g. trip circuit)","C.T. shorted to cassette #","Stage 1 (first contact to be closed - e.g. trip circuit)","Stage 1 (first contact to be made - e.g. trip circuit)","C.T. shorted to cassette #","Stage 1 (first contact to be made - e.g. trip circuit)","Stage 2 (second contact to be made - e.g. aux.supply or I/O)"," ","Stage 2 (second contact to be made - e.g. aux.supply or I/O)"]
[null,null,null,"Stage 2 (second contact to be closed - e.g. aux.supply or I/O)"," ","Stage 2 (second contact to be closed - e.g. aux.supply or I/O)","Stage 2 (second contact to be made - e.g. aux.supply or I/O)"," ","Stage 2 (second contact to be made - e.g. aux.supply or I/O)","Stage 3 (third contact to be made - e.g. VT)"," ","Stage 3 (third contact to be made - e.g. VT)"]
[null,null,null,"Stage 3 (third contact to be closed - e.g. VT)"," ","Stage 3 (third contact to be closed - e.g. VT)","Stage 3 (third contact to be made - e.g. VT)"," ","Stage 3 (third contact to be made - e.g. VT)","Monitoring points (for monitoring I/O without breaking connection to relay)"," ","Monitoring points (for monitoring I/O without breaking connection to relay)"]
[null,null,null,"Monitoring points (for monitoring I/O without breaking connection to relay)"," ","Monitoring points (for monitoring I/O without breaking connection to relay)","Monitoring points (for monitoring I/O without breaking connection to relay)"," ","Monitoring points (for monitoring I/O without breaking connection to relay)","Blank cassette (for labelling and isolation)"," ","Blank cassette (for labelling and isolation)"]
[null,null,null,"Blank cassette (for labelling and isolation)"," ","Blank cassette (for labelling and isolation)","Blank cassette (for labelling and isolation)"," ","Blank cassette (for labelling and isolation)",5,1,5]
[null,null,null,6,2,6,6,2,6]
[]
[3,"Combination \"lookup\" array for Cassette #1"]
[null,1,{"$f":"CONCATENATE(HLOOKUP('Date Drivers'!$B$14,'Date Drivers'!$B$1:$I$13,2),\"#2\")","v":"C.T. with shorting link to cassette #2"},{"$f":"HLOOKUP('Date Drivers'!$B$14,'Date Drivers'!$B$1:$I$13,8)","v":8}]
[null,2,{"$f":"HLOOKUP('Date Drivers'!B14,'Date Drivers'!$B$1:$J$13,3)","v":"Stage 1 (first contact to be made - e.g. trip circuit)"},1]
[null,3,{"$f":"HLOOKUP('Date Drivers'!$B$14,'Date Drivers'!$B$1:$J$13,4)","v":"Stage 2 (second contact to be made - e.g. aux.supply or I/O)"},2]
[null,4,{"$f":"HLOOKUP('Date Drivers'!$B$14,'Date Drivers'!$B$1:$J$13,5)","v":"Stage 3 (third contact to be made - e.g. VT)"},3]
[null,5,{"$f":"HLOOKUP('Date Drivers'!$B$14,'Date Drivers'!$B$1:$J$13,6)","v":"Monitoring points (for monitoring I/O without breaking connection to relay)"},4]
[null,6,{"$f":"HLOOKUP('Date Drivers'!$B$14,'Date Drivers'!$B$1:$J$13,7)","v":"Blank cassette (for labelling and isolation)"},0]
[3,"Combination \"lookup\" array for Cassette #2",null,null,{"$f":"VLOOKUP($A$49,$B$50:$D$55,3)","v":2}]
[null,1,{"$f":"CONCATENATE(HLOOKUP('Date Drivers'!$B$14,'Date Drivers'!$B$1:$I$13,2),\"#3\")","v":"C.T. with shorting link to cassette #3"},{"$f":"HLOOKUP('Date Drivers'!$B$14,'Date Drivers'!$B$1:$I$13,8)","v":8}]
[null,2,{"$f":"HLOOKUP($E$56,$D$40:$F$47,3)","v":"Stage 1 (first contact to be closed - e.g. trip circuit)"},{"$f":"IF($E$56=8,9,1)","v":1}]
[null,3,{"$f":"HLOOKUP($E$56,$D$40:$F$47,4)","v":"Stage 2 (second contact to be closed - e.g. aux.supply or I/O)"},{"$f":"IF($E$56=8,9,2)","v":2}]
[null,4,{"$f":"HLOOKUP($E$56,$D$40:$F$47,5)","v":"Stage 3 (third contact to be closed - e.g. VT)"},{"$f":"IF($E$56=8,9,3)","v":3}]
[null,5,{"$f":"HLOOKUP($E$56,$D$40:$F$47,6)","v":"Monitoring points (for monitoring I/O without breaking connection to relay)"},{"$f":"IF($E$56=8,9,4)","v":4}]
[null,6,{"$f":"HLOOKUP($E$56,$D$40:$F$47,7)","v":"Blank cassette (for labelling and isolation)"},{"$f":"IF($E$56=8,9,0)","v":0}]
[3,"Combination \"lookup\" array for Cassette #3",null,null,{"$f":"VLOOKUP($A$56,$B$57:$D$62,3)","v":2}]
[null,1,{"$f":"CONCATENATE(HLOOKUP('Date Drivers'!$B$14,'Date Drivers'!$B$1:$I$13,2),\"#4\")","v":"C.T. with shorting link to cassette #4"},{"$f":"HLOOKUP('Date Drivers'!$B$14,'Date Drivers'!$B$1:$I$13,8)","v":8}]
[null,2,{"$f":"IF($E$63=8,CONCATENATE(HLOOKUP($E$63,$G$40:$I$47,3),\" 2\"),HLOOKUP($E$63,$G$40:$I$47,3))","v":"Stage 1 (first contact to be made - e.g. trip circuit)"},{"$f":"IF($E$63=8,9,1)","v":1}]
[null,3,{"$f":"HLOOKUP($E$63,$G$40:$I$47,4)","v":"Stage 2 (second contact to be made - e.g. aux.supply or I/O)"},{"$f":"IF($E$63=8,9,2)","v":2}]
[null,4,{"$f":"HLOOKUP($E$63,$G$40:$I$47,5)","v":"Stage 3 (third contact to be made - e.g. VT)"},{"$f":"IF($E$63=8,9,3)","v":3}]
[null,5,{"$f":"HLOOKUP($E$63,$G$40:$I$47,6)","v":"Monitoring points (for monitoring I/O without breaking connection to relay)"},{"$f":"IF($E$63=8,9,4)","v":4}]
[null,6,{"$f":"HLOOKUP($E$63,$G$40:$I$47,7)","v":"Blank cassette (for labelling and isolation)"},{"$f":"IF($E$63=8,9,0)","v":0}]
[3,"Combination \"lookup\" array for Cassette #4",null,null,{"$f":"VLOOKUP($A$63,$B$64:$D$69,3)","v":2}]
[null,1,{"$f":"CONCATENATE(HLOOKUP('Date Drivers'!$B$14,'Date Drivers'!$B$1:$I$13,2),\"#5\")","v":"C.T. with shorting link to cassette #5"},{"$f":"HLOOKUP('Date Drivers'!$B$14,'Date Drivers'!$B$1:$I$13,8)","v":8}]
[null,2,{"$f":"IF($E$70=8,CONCATENATE(HLOOKUP($E$70,$G$40:$I$47,3),\" 3\"),HLOOKUP($E$70,$G$40:$I$47,3))","v":"Stage 1 (first contact to be made - e.g. trip circuit)"},{"$f":"IF($E$70=8,9,1)","v":1}]
[null,3,{"$f":"HLOOKUP($E$70,$G$40:$I$47,4)","v":"Stage 2 (second contact to be made - e.g. aux.supply or I/O)"},{"$f":"IF($E$70=8,9,2)","v":2}]
[null,4,{"$f":"HLOOKUP($E$70,$G$40:$I$47,5)","v":"Stage 3 (third contact to be made - e.g. VT)"},{"$f":"IF($E$70=8,9,3)","v":3}]
[null,5,{"$f":"HLOOKUP($E$70,$G$40:$I$47,6)","v":"Monitoring points (for monitoring I/O without breaking connection to relay)"},{"$f":"IF($E$70=8,9,4)","v":4}]
[null,6,{"$f":"HLOOKUP($E$70,$G$40:$I$47,7)","v":"Blank cassette (for labelling and isolation)"},{"$f":"IF($E$70=8,9,0)","v":0}]
[3,"Combination \"lookup\" array for Cassette #5",null,null,{"$f":"VLOOKUP($A$70,$B$71:$D$76,3)","v":2}]
[null,1,{"$f":"CONCATENATE(HLOOKUP('Date Drivers'!$B$14,'Date Drivers'!$B$1:$I$13,2),\"#6\")","v":"C.T. with shorting link to cassette #6"},{"$f":"HLOOKUP('Date Drivers'!$B$14,'Date Drivers'!$B$1:$I$13,8)","v":8}]
[null,2,{"$f":"IF($E$77=8,CONCATENATE(HLOOKUP($E$77,$G$40:$I$47,3),\" 4\"),HLOOKUP($E$77,$G$40:$I$47,3))","v":"Stage 1 (first contact to be made - e.g. trip circuit)"},{"$f":"IF($E$77=8,9,1)","v":1}]
[null,3,{"$f":"HLOOKUP($E$77,$G$40:$I$47,4)","v":"Stage 2 (second contact to be made - e.g. aux.supply or I/O)"},{"$f":"IF($E$77=8,9,2)","v":2}]
[null,4,{"$f":"HLOOKUP($E$77,$G$40:$I$47,5)","v":"Stage 3 (third contact to be made - e.g. VT)"},{"$f":"IF($E$77=8,9,3)","v":3}]
[null,5,{"$f":"HLOOKUP($E$77,$G$40:$I$47,6)","v":"Monitoring points (for monitoring I/O without breaking connection to relay)"},{"$f":"IF($E$77=8,9,4)","v":4}]
[null,6,{"$f":"HLOOKUP($E$77,$G$40:$I$47,7)","v":"Blank cassette (for labelling and isolation)"},{"$f":"IF($E$77=8,9,0)","v":0}]
[3,"Combination \"lookup\" array for Cassette #6",null,null,{"$f":"VLOOKUP($A$77,$B$78:$D$83,3)","v":2}]
[null,1,{"$f":"CONCATENATE(HLOOKUP('Date Drivers'!$B$14,'Date Drivers'!$B$1:$I$13,2),\"#7\")","v":"C.T. with shorting link to cassette #7"},{"$f":"HLOOKUP('Date Drivers'!$B$14,'Date Drivers'!$B$1:$I$13,8)","v":8}]
[null,2,{"$f":"IF($E$84=8,CONCATENATE(HLOOKUP($E$84,$G$40:$I$47,3),\" 5\"),HLOOKUP($E$84,$G$40:$I$47,3))","v":"Stage 1 (first contact to be made - e.g. trip circuit)"},{"$f":"IF($E$84=8,9,1)","v":1}]
[null,3,{"$f":"HLOOKUP($E$84,$G$40:$I$47,4)","v":"Stage 2 (second contact to be made - e.g. aux.supply or I/O)"},{"$f":"IF($E$84=8,9,2)","v":2}]
[null,4,{"$f":"HLOOKUP($E$84,$G$40:$I$47,5)","v":"Stage 3 (third contact to be made - e.g. VT)"},{"$f":"IF($E$84=8,9,3)","v":3}]
[null,5,{"$f":"HLOOKUP($E$84,$G$40:$I$47,6)","v":"Monitoring points (for monitoring I/O without breaking connection to relay)"},{"$f":"IF($E$84=8,9,4)","v":4}]
[null,6,{"$f":"HLOOKUP($E$84,$G$40:$I$47,7)","v":"Blank cassette (for labelling and isolation)"},{"$f":"IF($E$84=8,9,0)","v":0}]
[6,"Combination \"lookup\" array for Cassette #7",null,null,{"$f":"VLOOKUP($A$84,$B$85:$D$90,3)","v":2}]
[null,1,{"$f":"CONCATENATE(HLOOKUP('Date Drivers'!$B$14,'Date Drivers'!$B$1:$I$13,2),\"#8\")","v":"C.T. with shorting link to cassette #8"},{"$f":"HLOOKUP('Date Drivers'!$B$14,'Date Drivers'!$B$1:$I$13,8)","v":8}]
[null,2,{"$f":"IF($E$91=8,CONCATENATE(HLOOKUP($E$91,$G$40:$I$47,3),\" 6\"),HLOOKUP($E$91,$G$40:$I$47,3))","v":"Stage 1 (first contact to be made - e.g. trip circuit)"},{"$f":"IF($E$91=8,9,1)","v":1}]
[null,3,{"$f":"HLOOKUP($E$91,$G$40:$I$47,4)","v":"Stage 2 (second contact to be made - e.g. aux.supply or I/O)"},{"$f":"IF($E$91=8,9,2)","v":2}]
[null,4,{"$f":"HLOOKUP($E$91,$G$40:$I$47,5)","v":"Stage 3 (third contact to be made - e.g. VT)"},{"$f":"IF($E$91=8,9,3)","v":3}]
[null,5,{"$f":"HLOOKUP($E$91,$G$40:$I$47,6)","v":"Monitoring points (for monitoring I/O without breaking connection to relay)"},{"$f":"IF($E$91=8,9,4)","v":4}]
[null,6,{"$f":"HLOOKUP($E$91,$G$40:$I$47,7)","v":"Blank cassette (for labelling and isolation)"},{"$f":"IF($E$91=8,9,0)","v":0}]
[6,"Combination \"lookup\" array for Cassette #8",null,null,{"$f":"VLOOKUP($A$91,$B$92:$D$97,3)","v":0}]
[null,1,{"$f":"CONCATENATE(HLOOKUP('Date Drivers'!$B$14,'Date Drivers'!$B$1:$I$13,2),\"#9\")","v":"C.T. with shorting link to cassette #9"},{"$f":"HLOOKUP('Date Drivers'!$B$14,'Date Drivers'!$B$1:$I$13,8)","v":8}]
[null,2,{"$f":"IF($E$98=8,CONCATENATE(HLOOKUP($E$98,$G$40:$I$47,3),\" 7\"),HLOOKUP($E$98,$G$40:$I$47,3))","v":"Stage 1 (first contact to be made - e.g. trip circuit)"},{"$f":"IF($E$98=8,9,1)","v":1}]
[null,3,{"$f":"HLOOKUP($E$98,$G$40:$I$47,4)","v":"Stage 2 (second contact to be made - e.g. aux.supply or I/O)"},{"$f":"IF($E$98=8,9,2)","v":2}]
[null,4,{"$f":"HLOOKUP($E$98,$G$40:$I$47,5)","v":"Stage 3 (third contact to be made - e.g. VT)"},{"$f":"IF($E$98=8,9,3)","v":3}]
[null,5,{"$f":"HLOOKUP($E$98,$G$40:$I$47,6)","v":"Monitoring points (for monitoring I/O without breaking connection to relay)"},{"$f":"IF($E$98=8,9,4)","v":4}]
[null,6,{"$f":"HLOOKUP($E$98,$G$40:$I$47,7)","v":"Blank cassette (for labelling and isolation)"},{"$f":"IF($E$98=8,9,0)","v":0}]
[6,"Combination \"lookup\" array for Cassette #9",null,null,{"$f":"VLOOKUP($A$98,$B$99:$D$104,3)","v":0}]
[null,1,{"$f":"CONCATENATE(HLOOKUP('Date Drivers'!$B$14,'Date Drivers'!$B$1:$I$13,2),\"#10\")","v":"C.T. with shorting link to cassette #10"},{"$f":"HLOOKUP('Date Drivers'!$B$14,'Date Drivers'!$B$1:$I$13,8)","v":8}]
[null,2,{"$f":"IF($E$105=8,CONCATENATE(HLOOKUP($E$105,$G$40:$I$47,3),\" 8\"),HLOOKUP($E$105,$G$40:$I$47,3))","v":"Stage 1 (first contact to be made - e.g. trip circuit)"},{"$f":"IF($E$105=8,9,1)","v":1}]
[null,3,{"$f":"HLOOKUP($E$105,$G$40:$I$47,4)","v":"Stage 2 (second contact to be made - e.g. aux.supply or I/O)"},{"$f":"IF($E$105=8,9,2)","v":2}]
[null,4,{"$f":"HLOOKUP($E$105,$G$40:$I$47,5)","v":"Stage 3 (third contact to be made - e.g. VT)"},{"$f":"IF($E$105=8,9,3)","v":3}]
[null,5,{"$f":"HLOOKUP($E$105,$G$40:$I$47,6)","v":"Monitoring points (for monitoring I/O without breaking connection to relay)"},{"$f":"IF($E$105=8,9,4)","v":4}]
[null,6,{"$f":"HLOOKUP($E$105,$G$40:$I$47,7)","v":"Blank cassette (for labelling and isolation)"},{"$f":"IF($E$105=8,9,0)","v":0}]
[6,"Combination \"lookup\" array for Cassette #10",null,null,{"$f":"VLOOKUP($A$105,$B$106:$D$111,3)","v":0}]
[null,1,{"$f":"CONCATENATE(HLOOKUP('Date Drivers'!$B$14,'Date Drivers'!$B$1:$I$13,2),\"#11\")","v":"C.T. with shorting link to cassette #11"},{"$f":"HLOOKUP('Date Drivers'!$B$14,'Date Drivers'!$B$1:$I$13,8)","v":8}]
[null,2,{"$f":"IF($E$112=8,CONCATENATE(HLOOKUP($E$112,$G$40:$I$47,3),\" 9\"),HLOOKUP($E$112,$G$40:$I$47,3))","v":"Stage 1 (first contact to be made - e.g. trip circuit)"},{"$f":"IF($E$112=8,9,1)","v":1}]
[null,3,{"$f":"HLOOKUP($E$112,$G$40:$I$47,4)","v":"Stage 2 (second contact to be made - e.g. aux.supply or I/O)"},{"$f":"IF($E$112=8,9,2)","v":2}]
[null,4,{"$f":"HLOOKUP($E$112,$G$40:$I$47,5)","v":"Stage 3 (third contact to be made - e.g. VT)"},{"$f":"IF($E$112=8,9,3)","v":3}]
[null,5,{"$f":"HLOOKUP($E$112,$G$40:$I$47,6)","v":"Monitoring points (for monitoring I/O without breaking connection to relay)"},{"$f":"IF($E$112=8,9,4)","v":4}]
[null,6,{"$f":"HLOOKUP($E$112,$G$40:$I$47,7)","v":"Blank cassette (for labelling and isolation)"},{"$f":"IF($E$112=8,9,0)","v":0}]
[6,"Combination \"lookup\" array for Cassette #11",null,null,{"$f":"VLOOKUP($A$112,$B$113:$D$118,3)","v":0}]
[null,1,{"$f":"CONCATENATE(HLOOKUP('Date Drivers'!$B$14,'Date Drivers'!$B$1:$I$13,2),\"#12\")","v":"C.T. with shorting link to cassette #12"},{"$f":"HLOOKUP('Date Drivers'!$B$14,'Date Drivers'!$B$1:$I$13,8)","v":8}]
[null,2,{"$f":"IF($E$119=8,CONCATENATE(HLOOKUP($E$119,$G$40:$I$47,3),\" 10\"),HLOOKUP($E$119,$G$40:$I$47,3))","v":"Stage 1 (first contact to be made - e.g. trip circuit)"},{"$f":"IF($E$119=8,9,1)","v":1}]
[null,3,{"$f":"HLOOKUP($E$119,$G$40:$I$47,4)","v":"Stage 2 (second contact to be made - e.g. aux.supply or I/O)"},{"$f":"IF($E$119=8,9,2)","v":2}]
[null,4,{"$f":"HLOOKUP($E$119,$G$40:$I$47,5)","v":"Stage 3 (third contact to be made - e.g. VT)"},{"$f":"IF($E$119=8,9,3)","v":3}]
[null,5,{"$f":"HLOOKUP($E$119,$G$40:$I$47,6)","v":"Monitoring points (for monitoring I/O without breaking connection to relay)"},{"$f":"IF($E$119=8,9,4)","v":4}]
[null,6,{"$f":"HLOOKUP($E$119,$G$40:$I$47,7)","v":"Blank cassette (for labelling and isolation)"},{"$f":"IF($E$119=8,9,0)","v":0}]
[6,"Combination \"lookup\" array for Cassette #12",null,null,{"$f":"VLOOKUP($A$119,$B$120:$D$125,3)","v":0}]
[null,1,{"$f":"CONCATENATE(HLOOKUP('Date Drivers'!$B$14,'Date Drivers'!$B$1:$I$13,2),\"#13\")","v":"C.T. with shorting link to cassette #13"},{"$f":"HLOOKUP('Date Drivers'!$B$14,'Date Drivers'!$B$1:$I$13,8)","v":8}]
[null,2,{"$f":"IF($E$126=8,CONCATENATE(HLOOKUP($E$126,$G$40:$I$47,3),\" 11)\"),HLOOKUP($E$126,$G$40:$I$47,3))","v":"Stage 1 (first contact to be made - e.g. trip circuit)"},{"$f":"IF($E$126=8,9,1)","v":1}]
[null,3,{"$f":"HLOOKUP($E$126,$G$40:$I$47,4)","v":"Stage 2 (second contact to be made - e.g. aux.supply or I/O)"},{"$f":"IF($E$126=8,9,2)","v":2}]
[null,4,{"$f":"HLOOKUP($E$126,$G$40:$I$47,5)","v":"Stage 3 (third contact to be made - e.g. VT)"},{"$f":"IF($E$126=8,9,3)","v":3}]
[null,5,{"$f":"HLOOKUP($E$126,$G$40:$I$47,6)","v":"Monitoring points (for monitoring I/O without breaking connection to relay)"},{"$f":"IF($E$126=8,9,4)","v":4}]
[null,6,{"$f":"HLOOKUP($E$126,$G$40:$I$47,7)","v":"Blank cassette (for labelling and isolation)"},{"$f":"IF($E$126=8,9,0)","v":0}]
[6,"Combination \"lookup\" array for Cassette #13",null,null,{"$f":"VLOOKUP($A$126,$B$127:$D$132,3)","v":0}]
[null,1,{"$f":"CONCATENATE(HLOOKUP('Date Drivers'!$B$14,'Date Drivers'!$B$1:$I$13,2),\"#14\")","v":"C.T. with shorting link to cassette #14"},{"$f":"HLOOKUP('Date Drivers'!$B$14,'Date Drivers'!$B$1:$I$13,8)","v":8}]
[null,2,{"$f":"IF($E$133=8,CONCATENATE(HLOOKUP($E$133,$G$40:$I$47,3),\" 12\"),HLOOKUP($E$133,$G$40:$I$47,3))","v":"Stage 1 (first contact to be made - e.g. trip circuit)"},{"$f":"IF($E$133=8,9,1)","v":1}]
[null,3,{"$f":"HLOOKUP($E$133,$G$40:$I$47,4)","v":"Stage 2 (second contact to be made - e.g. aux.supply or I/O)"},{"$f":"IF($E$133=8,9,2)","v":2}]
[null,4,{"$f":"HLOOKUP($E$133,$G$40:$I$47,5)","v":"Stage 3 (third contact to be made - e.g. VT)"},{"$f":"IF($E$133=8,9,3)","v":3}]
[null,5,{"$f":"HLOOKUP($E$133,$G$40:$I$47,6)","v":"Monitoring points (for monitoring I/O without breaking connection to relay)"},{"$f":"IF($E$133=8,9,4)","v":4}]
[null,6,{"$f":"HLOOKUP($E$133,$G$40:$I$47,7)","v":"Blank cassette (for labelling and isolation)"},{"$f":"IF($E$133=8,9,0)","v":0}]
[5,"Combination \"lookup\" array for Cassette #14",null,null,{"$f":"VLOOKUP($A$133,$B$134:$D$139,3)","v":0}]
[null,1,{"$f":"HLOOKUP($E$140,$J$40:$L$45,2)","v":"Stage 1 (first contact to be made - e.g. trip circuit)"},{"$f":"IF($E$140=8,9,1)","v":1}]
[null,2,{"$f":"HLOOKUP($E$140,$J$40:$L$45,3)","v":"Stage 2 (second contact to be made - e.g. aux.supply or I/O)"},{"$f":"IF($E$140=8,9,2)","v":2}]
[null,3,{"$f":"HLOOKUP($E$140,$J$40:$L$45,4)","v":"Stage 3 (third contact to be made - e.g. VT)"},{"$f":"IF($E$140=8,9,3)","v":3}]
[null,4,{"$f":"HLOOKUP($E$140,$J$40:$L$45,5)","v":"Monitoring points (for monitoring I/O without breaking connection to relay)"},{"$f":"IF($E$140=8,9,4)","v":4}]
[null,5,{"$f":"HLOOKUP($E$140,$J$40:$L$45,6)","v":"Blank cassette (for labelling and isolation)"},{"$f":"IF($E$140=8,9,0)","v":0}]
[null,null,null,null,"QUANTITIES"]
[null,1,"Stage 1","GN0078001",{"$f":"COUNTIF(Nomenclature!$E$7:$R$7,1)","v":0}]
[null,2,"Stage 2","GN0078002",{"$f":"COUNTIF(Nomenclature!$E$7:$R$7,2)","v":6}]
[null,3,"Stage 3","GN0078003",{"$f":"COUNTIF(Nomenclature!$E$7:$R$7,3)","v":0}]
[null,4,"Monitoring points","GN0078005",{"$f":"COUNTIF(Nomenclature!$E$7:$R$7,4)","v":0}]
[null,8,"C.T.","GN0078004",{"$f":"COUNTIF(Nomenclature!$E$7:$R$7,8)","v":0}]
[null,9,"C.T.","GN0078004",{"$f":"COUNTIF(Nomenclature!$E$7:$R$7,9)","v":0}]
[null,0,"Blank cassette","GN0078006",{"$f":"COUNTIF(Nomenclature!$E$7:$R$7,0)","v":8},null," "]
[]
[null,0," "," "]
[null,1," "," "]
[null,2,{"$f":"HLOOKUP('Date Drivers'!$B$14,'Date Drivers'!$C$1:$H$41,16)","v":"CT Shorting Bar - 2 Way"},{"$f":"HLOOKUP('Date Drivers'!$B$14,'Date Drivers'!$C$1:$H$41,29)","v":"GN2065001"}]
[null,3,{"$f":"HLOOKUP('Date Drivers'!$B$14,'Date Drivers'!$C$1:$H$41,17)","v":"CT Shorting Bar - 3 Way"},{"$f":"HLOOKUP('Date Drivers'!$B$14,'Date Drivers'!$C$1:$H$41,30)","v":"GN2065002"}]
[null,4,{"$f":"HLOOKUP('Date Drivers'!$B$14,'Date Drivers'!$C$1:$H$41,18)","v":"CT Shorting Bar - 4 Way"},{"$f":"HLOOKUP('Date Drivers'!$B$14,'Date Drivers'!$C$1:$H$41,31)","v":"GN2065003"}]
[null,5,{"$f":"HLOOKUP('Date Drivers'!$B$14,'Date Drivers'!$C$1:$H$41,19)","v":"CT Shorting Bar - 5 Way"},{"$f":"HLOOKUP('Date Drivers'!$B$14,'Date Drivers'!$C$1:$H$41,32)","v":"GN2065004"}]
[null,6,{"$f":"HLOOKUP('Date Drivers'!$B$14,'Date Drivers'!$C$1:$H$41,20)","v":"CT Shorting Bar - 6 Way"},{"$f":"HLOOKUP('Date Drivers'!$B$14,'Date Drivers'!$C$1:$H$41,33)","v":"GN2065005"}]
[null,7,{"$f":"HLOOKUP('Date Drivers'!$B$14,'Date Drivers'!$C$1:$H$41,21)","v":"CT Shorting Bar - 7 Way"},{"$f":"HLOOKUP('Date Drivers'!$B$14,'Date Drivers'!$C$1:$H$41,34)","v":"GN2065006"}]
[null,8,{"$f":"HLOOKUP('Date Drivers'!$B$14,'Date Drivers'!$C$1:$H$41,22)","v":"CT Shorting Bar - 8 Way"},{"$f":"HLOOKUP('Date Drivers'!$B$14,'Date Drivers'!$C$1:$H$41,35)","v":"GN2065007"}]
[null,9,{"$f":"HLOOKUP('Date Drivers'!$B$14,'Date Drivers'!$C$1:$H$41,23)","v":"CT Shorting Bar - 9 Way"},{"$f":"HLOOKUP('Date Drivers'!$B$14,'Date Drivers'!$C$1:$H$41,36)","v":"GN2065008"}]
[null,10,{"$f":"HLOOKUP('Date Drivers'!$B$14,'Date Drivers'!$C$1:$H$41,24)","v":"CT Shorting Bar - 10 Way"},{"$f":"HLOOKUP('Date Drivers'!$B$14,'Date Drivers'!$C$1:$H$41,37)","v":"GN2065009"}]
[null,11,{"$f":"HLOOKUP('Date Drivers'!$B$14,'Date Drivers'!$C$1:$H$41,25)","v":"CT Shorting Bar - 11 Way"},{"$f":"HLOOKUP('Date Drivers'!$B$14,'Date Drivers'!$C$1:$H$41,38)","v":"GN2065999"}]
[null,12,{"$f":"HLOOKUP('Date Drivers'!$B$14,'Date Drivers'!$C$1:$H$41,26)","v":"CT Shorting Bar - 12 Way"},{"$f":"HLOOKUP('Date Drivers'!$B$14,'Date Drivers'!$C$1:$H$41,39)","v":"GN2065999"}]
[null,13,{"$f":"HLOOKUP('Date Drivers'!$B$14,'Date Drivers'!$C$1:$H$41,27)","v":"CT Shorting Bar - 13 Way"},{"$f":"HLOOKUP('Date Drivers'!$B$14,'Date Drivers'!$C$1:$H$41,40)","v":"GN2065999"}]
[null,14,{"$f":"HLOOKUP('Date Drivers'!$B$14,'Date Drivers'!$C$1:$H$41,28)","v":"CT Shorting Bar - 14 Way"},{"$f":"HLOOKUP('Date Drivers'!$B$14,'Date Drivers'!$C$1:$H$41,41)","v":"GN2065999"}]
[]
[2]
[null,1,"Grey Livery - Withdrawn","*"]
[null,2,"Black/Grey GE Livery","D"]
[]
[null,1,{"$f":"HLOOKUP('Date Drivers'!$B$14,'Date Drivers'!$C$1:$H$57,50)","v":"No"},{"$f":"HLOOKUP('Date Drivers'!$B$14,'Date Drivers'!$C$1:$H$57,52)","v":"Selection NOT REQUIRED"}," "," ",1]
[null,2,{"$f":"HLOOKUP('Date Drivers'!$B$14,'Date Drivers'!$C$1:$H$57,51)","v":"Yes"},{"$f":"HLOOKUP('Date Drivers'!$B$14,'Date Drivers'!$C$1:$H$57,53)","v":"Multiple finger test plug (MFTP)"},{"$f":"HLOOKUP('Date Drivers'!$B$14,'Date Drivers'!$C$1:$H$57,54)","v":"Single finger test plug (SFTP)"},{"$f":"HLOOKUP('Date Drivers'!$B$14,'Date Drivers'!$C$1:$H$57,55)","v":"Single finger isolating plug (SFIP)"},{"$f":"HLOOKUP('Date Drivers'!$B$14,'Date Drivers'!$C$1:$H$57,57)","v":3}]
[]
[null,1,"Option Selection Key",2]
[null,1,{"$f":"VLOOKUP($B$178,$B$175:$G$176,3)","v":"Selection NOT REQUIRED"},{"$f":"IF($B$178=1,\"\",CONCATENATE(\"You require Item : P992\",D172))","v":""}]
[null,2,{"$f":"VLOOKUP($B$178,$B$175:$G$176,4)","v":" "},{"$f":"IF($B$178=1,\"\",CONCATENATE(\"You require Item : P993\",D172))","v":""}]
[null,3,{"$f":"VLOOKUP($B$178,$B$175:$G$176,5)","v":" "},{"$f":"IF($B$178=1,\"\",CONCATENATE(\"You require Item : P994\",\"A\"))","v":""}]

{"sheet":"Master Text","index":5,"n_rows":46,"n_cols":3,"rows_kept":46,"cut":false,"hidden":false,"merged":[]}
[{"$f":"CONCATENATE(Nomenclature!$D$7,Nomenclature!$E$7,Nomenclature!$F$7,Nomenclature!$G$7,Nomenclature!$H$7,Nomenclature!$I$7,Nomenclature!$J$7,Nomenclature!$K$7,Nomenclature!$L$7,Nomenclature!$M$7,Nomenclature!$N$7,Nomenclature!$O$7,Nomenclature!$P$7,Nomenclature!$Q$7,Nomenclature!$R$7,Nomenclature!$S$7)","v":"P22222200000000D"},{"$f":"A1","v":"P22222200000000D"}]
[null,"P991 NEW TEST BLOCK"]
[null,"FOR USE ONLY WITH :"]
[null,"P992 - MULTI-FINGER TEST PLUG"]
[null,"P993 - SINGLE FINGER TEST PLUG"]
[null,"P994 - SINGLE FINGER ISOLATING PLUG"]
[]
[null,"RATED","300V, 20A"]
[{"$f":"MID($A$1,2,1)","v":"2"},"SLOT 1",{"$f":"VLOOKUP(A9,$A$25:$B$31,2,FALSE)","v":"Stage 2"}]
[{"$f":"MID($A$1,3,1)","v":"2"},"SLOT 2",{"$f":"VLOOKUP(A10,$A$25:$B$31,2,FALSE)","v":"Stage 2"}]
[{"$f":"MID($A$1,4,1)","v":"2"},"SLOT 3","Stage 2"]
[{"$f":"MID($A$1,5,1)","v":"2"},"SLOT 4","Stage 2"]
[{"$f":"MID($A$1,6,1)","v":"2"},"SLOT 5","Stage 2"]
[{"$f":"MID($A$1,7,1)","v":"2"},"SLOT 6","Stage 2"]
[{"$f":"MID($A$1,8,1)","v":"0"},"SLOT 7","Blank Cassette"]
[{"$f":"MID($A$1,9,1)","v":"0"},"SLOT 8","Blank Cassette"]
[{"$f":"MID($A$1,10,1)","v":"0"},"SLOT 9","Blank Cassette"]
[{"$f":"MID($A$1,11,1)","v":"0"},"SLOT 10","Blank Cassette"]
[{"$f":"MID($A$1,12,1)","v":"0"},"SLOT 11","Blank Cassette"]
[{"$f":"MID($A$1,13,1)","v":"0"},"SLOT 12","Blank Cassette"]
[{"$f":"MID($A$1,14,1)","v":"0"},"SLOT 13","Blank Cassette"]
[{"$f":"MID($A$1,15,1)","v":"0"},"SLOT 14","Blank Cassette"]
[{"$f":"MID($A$1,16,1)","v":"D"}]
[]
["0","Blank Cassette"]
["1","Stage 1"]
["2","Stage 2"]
["3","Stage 3"]
["4","Monitor"]
["8","Short"]
["9","Short"]
[]
[null,"A","Original - 16/10/2000"]
[null,"B","C.T.cassette was GN0078005 in error & Monitoring points cassette was GN0078004 in error - 19/03/2001"]
[null,"C","Stabilised form of contact arms introduced. Design suffices introduced - 08/01/2002"]
[null,"D","Single part CT contact arm replaced by 2-part on P991, contact width reduced on P992, CT was ZB9011045 & moulding material was Noryl SE1GFN2 on P993. Design suffices were \"B\" - 04/04/2002"]
[null,"E","Reconfiguration safety note added - 04/07/2002"]
[null,"F","9 Way shorting link GN2065008 and 10 way shorting link GN2065009 added to BOM as per CDN R5241 - 19/10/2004"]
[null,"G","Master Text sheet created, BOM data hidden as this product is configured on SAP - 18/05/2005"]
[null,"H","P994 added to Nomenclature & header - 29/09/2005"]
[null,"I","Reference to MiCOM removed - 07/10/2010"]
[null,"J","References to P994 removed - 26/05/2016"]
[null,"K","Release of P994 Isolation Plug - CID SWOO-AHXFU8"]
[null,"L","Rebranded Black P991 option released by CID006738 - 05/01/2021"]
[null,"M","Lookup corrected for P992 and P993 in Nomenclature, should be C sufffix - 20/04/2021"]
[null,"N","Grey Livery option withdrawn - CID0008131, GE Publication GER-4947 - 02/01/2024"]

{"sheet":"MIFAS Data","index":6,"n_rows":72,"n_cols":8,"rows_kept":72,"cut":false,"hidden":true,"merged":[[6,3,8,5]]}
[null,"P990 TEST BLOCK - RATING OPTIONS"]
[null,"(No name)",null,null,null,null,"MODEL"]
["MODEL RANGE :","P990","D/S :",{"$f":"Nomenclature!$S$7","v":"D"},"ISSUE :",5,"TYPE :","MIDOS"]
["MODEL NUMBER :",{"$f":"CONCATENATE(Nomenclature!D7,Nomenclature!E7,Nomenclature!F7,Nomenclature!G7,Nomenclature!H7,Nomenclature!I7,Nomenclature!J7,Nomenclature!K7,Nomenclature!L7,Nomenclature!M7,Nomenclature!N7,Nomenclature!O7,Nomenclature!P7,Nomenclature!Q7,Nomenclature!R7,Nomenclature!S7)","v":"P22222200000000D"},null,null,null,"PGROUP",111011]
["SCHEME Y/N: ","N           MODULAR Y/N: N",null,null,null,"Units",1]
[]
["(Maximum : 60 characters)","MICOM P991 TEST BLOCK",null,"NOTE : THESE RATING/TECHNICAL DETAILS ARE TYPICAL ONLY. EACH CONFIGURATION SHOULD BE REVIEWED/REVISED AT POINT OF CREATION."]
["(Maximum : 60 characters)","FOR USE ONLY WITH :"]
["(Maximum : 60 characters)","P992 - MULTI-FINGER TEST PLUG"]
["(Maximum : 60 characters)","P993 - SINGLE FINGER TEST PLUG"]
["(Maximum : 60 characters)","If it is necessary to reconfigure the P991 build after manufacture, then for safety reasons,"]
[null,"the assemblies must be returned to the manufacturing plant, for this purpose"]
[]
["MODEL SKELETON :","ANNNNNNNNNNNNNNXXXX","FROM",null,"TO"]
["CODE","DESCRIPTION","VALUE","UNIT","VALUE","UNIT"]
["(Page 1)"]
[1,"RATED",300,"V",20,"A"]
[2,"SLOT #",1,{"$f":"VLOOKUP(Database!$C$1,Database!$C$2:$BG$706,3)","v":"TO"},{"$f":"VLOOKUP(Database!$C$1,Database!$C$2:$BG$706,4)","v":4},{"$f":"VLOOKUP(Database!$C$1,Database!$C$2:$BG$706,5)","v":"STAGE2"}]
[3,"SLOT #",{"$f":"VLOOKUP(Database!$C$1,Database!$C$2:$BG$706,6)","v":5},{"$f":"VLOOKUP(Database!$C$1,Database!$C$2:$BG$706,7)","v":"AND"},{"$f":"VLOOKUP(Database!$C$1,Database!$C$2:$BG$706,8)","v":6},{"$f":"VLOOKUP(Database!$C$1,Database!$C$2:$BG$706,9)","v":"STAGE1"}]
[4,"SLOT #",{"$f":"VLOOKUP(Database!$C$1,Database!$C$2:$BG$706,10)","v":7},{"$f":"VLOOKUP(Database!$C$1,Database!$C$2:$BG$706,11)","v":"AND"},{"$f":"VLOOKUP(Database!$C$1,Database!$C$2:$BG$706,12)","v":8},{"$f":"VLOOKUP(Database!$C$1,Database!$C$2:$BG$706,13)","v":"STAGE3"}]
[5,"SLOT #",{"$f":"VLOOKUP(Database!$C$1,Database!$C$2:$BG$706,14)","v":9},{"$f":"VLOOKUP(Database!$C$1,Database!$C$2:$BG$706,15)","v":"AND"},{"$f":"VLOOKUP(Database!$C$1,Database!$C$2:$BG$706,16)","v":10},{"$f":"VLOOKUP(Database!$C$1,Database!$C$2:$BG$706,17)","v":"STAGE1"}]
[6,"SLOT #",{"$f":"VLOOKUP(Database!$C$1,Database!$C$2:$BG$706,18)","v":11},{"$f":"VLOOKUP(Database!$C$1,Database!$C$2:$BG$706,19)","v":"TO"},{"$f":"VLOOKUP(Database!$C$1,Database!$C$2:$BG$706,20)","v":14},{"$f":"VLOOKUP(Database!$C$1,Database!$C$2:$BG$706,21)","v":"SHORT"}]
[7,"SLOT #",{"$f":"VLOOKUP(Database!$C$1,Database!$C$2:$BG$706,22)","v":" "},{"$f":"VLOOKUP(Database!$C$1,Database!$C$2:$BG$706,23)","v":" "},{"$f":"VLOOKUP(Database!$C$1,Database!$C$2:$BG$706,24)","v":" "},{"$f":"VLOOKUP(Database!$C$1,Database!$C$2:$BG$706,25)","v":" "}]
[8,"SLOT #",{"$f":"VLOOKUP(Database!$C$1,Database!$C$2:$BG$706,26)","v":" "},{"$f":"VLOOKUP(Database!$C$1,Database!$C$2:$BG$706,27)","v":" "},{"$f":"VLOOKUP(Database!$C$1,Database!$C$2:$BG$706,28)","v":" "},{"$f":"VLOOKUP(Database!$C$1,Database!$C$2:$BG$706,29)","v":" "}]
[9,"SLOT #",{"$f":"VLOOKUP(Database!$C$1,Database!$C$2:$BG$706,30)","v":" "},{"$f":"VLOOKUP(Database!$C$1,Database!$C$2:$BG$706,31)","v":" "},{"$f":"VLOOKUP(Database!$C$1,Database!$C$2:$BG$706,32)","v":" "},{"$f":"VLOOKUP(Database!$C$1,Database!$C$2:$BG$706,33)","v":" "}]
[10,"SLOT #",{"$f":"VLOOKUP(Database!$C$1,Database!$C$2:$BG$706,34)","v":" "},{"$f":"VLOOKUP(Database!$C$1,Database!$C$2:$BG$706,35)","v":" "},{"$f":"VLOOKUP(Database!$C$1,Database!$C$2:$BG$706,36)","v":" "},{"$f":"VLOOKUP(Database!$C$1,Database!$C$2:$BG$706,37)","v":" "}]
["(Page 2)"]
[11,"SLOT #",{"$f":"VLOOKUP(Database!$C$1,Database!$C$2:$BG$706,38)","v":" "},{"$f":"VLOOKUP(Database!$C$1,Database!$C$2:$BG$706,39)","v":" "},{"$f":"VLOOKUP(Database!$C$1,Database!$C$2:$BG$706,40)","v":" "},{"$f":"VLOOKUP(Database!$C$1,Database!$C$2:$BG$706,41)","v":" "}]
[12,"SLOT #",{"$f":"VLOOKUP(Database!$C$1,Database!$C$2:$BG$706,42)","v":" "},{"$f":"VLOOKUP(Database!$C$1,Database!$C$2:$BG$706,43)","v":" "},{"$f":"VLOOKUP(Database!$C$1,Database!$C$2:$BG$706,44)","v":" "},{"$f":"VLOOKUP(Database!$C$1,Database!$C$2:$BG$706,45)","v":" "}]
[13,"SLOT #",{"$f":"VLOOKUP(Database!$C$1,Database!$C$2:$BG$706,46)","v":" "},{"$f":"VLOOKUP(Database!$C$1,Database!$C$2:$BG$706,47)","v":" "},{"$f":"VLOOKUP(Database!$C$1,Database!$C$2:$BG$706,48)","v":" "},{"$f":"VLOOKUP(Database!$C$1,Database!$C$2:$BG$706,49)","v":" "}]
[14,"SLOT #",{"$f":"VLOOKUP(Database!$C$1,Database!$C$2:$BG$706,50)","v":" "},{"$f":"VLOOKUP(Database!$C$1,Database!$C$2:$BG$706,51)","v":" "},{"$f":"VLOOKUP(Database!$C$1,Database!$C$2:$BG$706,52)","v":" "},{"$f":"VLOOKUP(Database!$C$1,Database!$C$2:$BG$706,53)","v":" "}]
[]
[null,"Case Assy",":",null,"Outline Wrapper",": GN0221"]
[null,"Reset Assy",":"]
[null,"Wiring/Circuit Diagram",": APPLICAT'N SPECIFIC",null,"Ext. Wiring/Connection Diagram",": APPLICAT'N SPECIFIC"]
[null,"Customer Diagram",": APPLICAT'N SPECIFIC",null,"Mounting Sketch",": "]
[null,"Wiring Schedule",": APPLICAT'N SPECIFIC",null,"Test Specification",": 50256.3800.001"]
[null,"Outline Ext. Components",":"]
[null,"Special Instructions",":"]
[]
[]
["Material List",null,null,"Drg","Variables",null,"Design"]
[null,"Description","Drawing Number","Ref","Description","Drg. Number","Suffix","Quantity"]
[null,"Final Assembly Parts","GN0079000",null,null,null,null,1]
[null,null,null,{"$f":"IF(Lookup!$E$147>0,1,\"\")","v":""},{"$f":"IF(Lookup!$E$147>0,\"Stage 1\",\"\")","v":""},{"$f":"IF(Lookup!$E$147>0,\"GN0078001\",\"\")","v":""},null,{"$f":"IF(Lookup!$E$147>0,Lookup!$E$147,\"\")","v":""}]
[null,null,null,{"$f":"IF(Lookup!$E$148>0,1,\"\")","v":1},{"$f":"IF(Lookup!$E$148>0,\"Stage 2\",\"\")","v":"Stage 2"},{"$f":"IF(Lookup!$E$148>0,\"GN0078002\",\"\")","v":"GN0078002"},null,{"$f":"IF(Lookup!$E$148>0,Lookup!$E$148,\"\")","v":6}]
[null,null,null,{"$f":"IF(Lookup!$E$149>0,1,\"\")","v":""},{"$f":"IF(Lookup!$E$149>0,\"Stage 3\",\"\")","v":""},{"$f":"IF(Lookup!$E$149>0,\"GN0078003\",\"\")","v":""},null,{"$f":"IF(Lookup!$E$149>0,Lookup!$E$149,\"\")","v":""}]
[null,null,null,{"$f":"IF(Lookup!$E$150>0,1,\"\")","v":""},{"$f":"IF(Lookup!$E$150>0,\"Monitoring points\",\"\")","v":""},{"$f":"IF(Lookup!$E$150>0,\"GN0078005\",\"\")","v":""},null,{"$f":"IF(Lookup!$E$150>0,Lookup!$E$150,\"\")","v":""}]
[null,null,null,{"$f":"IF(OR(Lookup!$E$151>0,Lookup!$E$152>0),1,\"\")","v":""},{"$f":"IF(OR(Lookup!$E$151>0,Lookup!$E$152>0),\"C.T.\",\"\")","v":""},{"$f":"IF(OR(Lookup!$E$151>0,Lookup!$E$152>0),\"GN0078004\",\"\")","v":""},null,{"$f":"IF(OR(Lookup!$E$151>0,Lookup!$E$152>0),(Lookup!$E$151+Lookup!$E$152),\"\")","v":""}]
[null,null,null,{"$f":"IF(Lookup!$E$153>0,1,\"\")","v":1},{"$f":"IF(Lookup!$E$153>0,\"Isolation\",\"\")","v":"Isolation"},{"$f":"IF(Lookup!$E$153>0,\"GN0078006\",\"\")","v":"GN0078006"},null,{"$f":"IF(Lookup!$E$153>0,Lookup!$E$153,\"\")","v":8}]
[null,null,null,{"$f":"IF($H51<>\"\",12,\"\")","v":""},{"$f":"IF(H51<>\"\",VLOOKUP(Nomenclature!U$6,Lookup!$B$155:$D$169,2),\"\")","v":""},{"$f":"IF(H51<>\"\",VLOOKUP(Nomenclature!U$6,Lookup!$B$155:$D$169,3),\"\")","v":""},null,{"$f":"IF(Nomenclature!$U$7=\"\",\"\",Nomenclature!U$7)","v":""}]
[null,null,null,{"$f":"IF($H52<>\"\",12,\"\")","v":""},{"$f":"IF(H52<>\"\",VLOOKUP(Nomenclature!V$6,Lookup!$B$155:$D$169,2),\"\")","v":""},{"$f":"IF(H52<>\"\",VLOOKUP(Nomenclature!V$6,Lookup!$B$155:$D$169,3),\"\")","v":""},null,{"$f":"IF(Nomenclature!$V$7=\"\",\"\",Nomenclature!V$7)","v":""}]
[null,null,null,"",{"$f":"IF(H53<>\"\",VLOOKUP(Nomenclature!W$6,Lookup!$B$155:$D$169,2),\"\")","v":""},{"$f":"IF(H53<>\"\",VLOOKUP(Nomenclature!W$6,Lookup!$B$155:$D$169,3),\"\")","v":""},null,{"$f":"IF(Nomenclature!$W$7=\"\",\"\",Nomenclature!W$7)","v":""}]
[null,null,null,"",{"$f":"IF(H54<>\"\",VLOOKUP(Nomenclature!X$6,Lookup!$B$155:$D$169,2),\"\")","v":""},{"$f":"IF(H54<>\"\",VLOOKUP(Nomenclature!X$6,Lookup!$B$155:$D$169,3),\"\")","v":""},null,{"$f":"IF(Nomenclature!$X$7=\"\",\"\",Nomenclature!X$7)","v":""}]
[null,null,null,"",{"$f":"IF(H55<>\"\",VLOOKUP(Nomenclature!Y$6,Lookup!$B$155:$D$169,2),\"\")","v":""},{"$f":"IF(H55<>\"\",VLOOKUP(Nomenclature!Y$6,Lookup!$B$155:$D$169,3),\"\")","v":""},null,{"$f":"IF(Nomenclature!$Y$7=\"\",\"\",Nomenclature!Y$7)","v":""}]
[null,null,null,"",{"$f":"IF(H56<>\"\",VLOOKUP(Nomenclature!Z$6,Lookup!$B$155:$D$169,2),\"\")","v":""},{"$f":"IF(H56<>\"\",VLOOKUP(Nomenclature!Z$6,Lookup!$B$155:$D$169,3),\"\")","v":""},null,{"$f":"IF(Nomenclature!$Z$7=\"\",\"\",Nomenclature!Z$7)","v":""}]
[null,null,null,"",{"$f":"IF(H57<>\"\",VLOOKUP(Nomenclature!AA$6,Lookup!$B$155:$D$169,2),\"\")","v":""},{"$f":"IF(H57<>\"\",VLOOKUP(Nomenclature!AA$6,Lookup!$B$155:$D$169,3),\"\")","v":""},null,{"$f":"IF(Nomenclature!$AA$7=\"\",\"\",Nomenclature!AA$7)","v":""}]
[null,null,null,"",{"$f":"IF(H58<>\"\",VLOOKUP(Nomenclature!AB$6,Lookup!$B$155:$D$169,2),\"\")","v":""},{"$f":"IF(H58<>\"\",VLOOKUP(Nomenclature!AB$6,Lookup!$B$155:$D$169,3),\"\")","v":""},null,{"$f":"IF(Nomenclature!$AB$7=\"\",\"\",Nomenclature!AB$7)","v":""}]
[null,null,null,"",{"$f":"IF(H59<>\"\",VLOOKUP(Nomenclature!AC$6,Lookup!$B$155:$D$169,2),\"\")","v":""},{"$f":"IF(H59<>\"\",VLOOKUP(Nomenclature!AC$6,Lookup!$B$155:$D$169,3),\"\")","v":""},null,{"$f":"IF(Nomenclature!$AC$7=\"\",\"\",Nomenclature!AC$7)","v":""}]
[null,null,null,"",{"$f":"IF(H60<>\"\",VLOOKUP(Nomenclature!AD$6,Lookup!$B$155:$D$169,2),\"\")","v":""},{"$f":"IF(H60<>\"\",VLOOKUP(Nomenclature!AD$6,Lookup!$B$155:$D$169,3),\"\")","v":""},null,{"$f":"IF(Nomenclature!$AD$7=\"\",\"\",Nomenclature!AD$7)","v":""}]
[null,null,null,"",{"$f":"IF(H61<>\"\",VLOOKUP(Nomenclature!AE$6,Lookup!$B$155:$D$169,2),\"\")","v":""},{"$f":"IF(H61<>\"\",VLOOKUP(Nomenclature!AE$6,Lookup!$B$155:$D$169,3),\"\")","v":""},null,{"$f":"IF(Nomenclature!$AE$7=\"\",\"\",Nomenclature!AE$7)","v":""}]
[null,null,null,"",{"$f":"IF(H62<>\"\",VLOOKUP(Nomenclature!AF$6,Lookup!$B$155:$D$169,2),\"\")","v":""},{"$f":"IF(H62<>\"\",VLOOKUP(Nomenclature!AF$6,Lookup!$B$155:$D$169,3),\"\")","v":""},null,{"$f":"IF(Nomenclature!$AF$7=\"\",\"\",Nomenclature!AF$7)","v":""}]
[null,null,null,"",{"$f":"IF(H63<>\"\",VLOOKUP(Nomenclature!AG$6,Lookup!$B$155:$D$169,2),\"\")","v":""},{"$f":"IF(H63<>\"\",VLOOKUP(Nomenclature!AG$6,Lookup!$B$155:$D$169,3),\"\")","v":""},null,{"$f":"IF(Nomenclature!$AG$7=\"\",\"\",Nomenclature!AG$7)","v":""}]
[]
[]
["Issue : 001 - As at 16/10/2000"]
["Issue : 002 - As at 19/03/2001 - C.T.cassette was GN0078005 in error & Monitoring points cassette was GN0078004 in error."]
["Issue : 003 - As at 08/01/2002 - Stabilised form of contact arms introduced. Design suffices introduced."]
["Issue : 004 - As at 04/04/2002 - Effective 26/03/2002 : Single part CT contact arm replaced by 2-part on P991, contact width reduced on P992, …"]
[null,"... CT was ZB9011045 & moulding material was Noryl SE1GFN2 on P993. Design suffices were \"B\"."]
["Issue : 005 - As at 04/07/2002 - Reconfiguration safety note added.."]
["Issue : 006 - As at 19/10/2004 - 9 Way shorting link GN2065008 and 10 way shorting link GN2065009 added to BOM as per CDN R5241"]

{"sheet":"Routing","index":7,"n_rows":9,"n_cols":5,"rows_kept":9,"cut":false,"hidden":true,"merged":[]}
[]
[null,"Model No:",{"$f":"'MIFAS Data'!B4","v":"P22222200000000D"}]
[null,"Ref Op. Set 50000141"]
[null,"Pre-Production Ref. Op. Set. 50000121"]
[]
[null,"104BA","Assemble cassette as per drawing GN0078",{"$f":"'Routing DB'!$D$10","v":11.600000000000003},"Mins"]
[null,"104BA","Test cassette as per test spec",{"$f":"'Routing DB'!$D$18","v":1.2},"Mins"]
[null,"104BA","Final Assembly",{"$f":"'Routing DB'!$E$36","v":6.25},"Mins"]
[null,"104BQ","Function Test & Product Check",1.8,"Mins"]

{"sheet":"Routing DB","index":8,"n_rows":40,"n_cols":20,"rows_kept":40,"cut":false,"hidden":true,"merged":[]}
[]
[null,null,null,null,null,null,1,2,3,4,5,6,7,8,9,10,11,12,13,14]
["ASSEMBLE CASSETTE ",null,"B.M.T",null,null,null,{"$f":"Nomenclature!$D$9","v":2},{"$f":"Nomenclature!$D$11","v":2},{"$f":"Nomenclature!$D$13","v":2},{"$f":"Nomenclature!$D$15","v":2},{"$f":"Nomenclature!$D$17","v":2},{"$f":"Nomenclature!$D$19","v":2},{"$f":"Nomenclature!$D$21","v":0},{"$f":"Nomenclature!$D$23","v":0},{"$f":"Nomenclature!$D$25","v":0},{"$f":"Nomenclature!$D$27","v":0},{"$f":"Nomenclature!$D$29","v":0},{"$f":"Nomenclature!$D$31","v":0},{"$f":"Nomenclature!$D$33","v":0},{"$f":"Nomenclature!$D$35","v":0}]
["Stage 1     GN0078001",1,1.4,null,null,null,{"$f":"VLOOKUP(G3,$G$9:$H$15,2)","v":1.4},{"$f":"VLOOKUP($H$3,$G$9:$H$15,2)","v":1.4},{"$f":"VLOOKUP($I$3,$G$9:$H$15,2)","v":1.4},{"$f":"VLOOKUP($J$3,$G$9:$H$15,2)","v":1.4},{"$f":"VLOOKUP($K$3,$G$9:$H$15,2)","v":1.4},{"$f":"VLOOKUP($L$3,$G$9:$H$15,2)","v":1.4},{"$f":"VLOOKUP($M$3,$G$9:$H$15,2)","v":0.4},{"$f":"VLOOKUP($N$3,$G$9:$H$15,2)","v":0.4},{"$f":"VLOOKUP($O$3,$G$9:$H$15,2)","v":0.4},{"$f":"VLOOKUP($P$3,$G$9:$H$15,2)","v":0.4},{"$f":"VLOOKUP($Q$3,$G$9:$H$15,2)","v":0.4},{"$f":"VLOOKUP($R$3,$G$9:$H$15,2)","v":0.4},{"$f":"VLOOKUP($S$3,$G$9:$H$15,2)","v":0.4},{"$f":"VLOOKUP($T$3,$G$9:$H$15,2)","v":0.4}]
["Stage 2     GN0078002",2,1.4,null,null,null,{"$f":"VLOOKUP($G$3,$G$9:$I$15,3)","v":0.2},{"$f":"VLOOKUP($H$3,$G$9:$I$15,3)","v":0.2},{"$f":"VLOOKUP($I$3,$G$9:$I$15,3)","v":0.2},{"$f":"VLOOKUP($J$3,$G$9:$I$15,3)","v":0.2},{"$f":"VLOOKUP($K$3,$G$9:$I$15,3)","v":0.2},{"$f":"VLOOKUP($L$3,$G$9:$I$15,3)","v":0.2},{"$f":"VLOOKUP($M$3,$G$9:$I$15,3)","v":0},{"$f":"VLOOKUP($N$3,$G$9:$I$15,3)","v":0},{"$f":"VLOOKUP($O$3,$G$9:$I$15,3)","v":0},{"$f":"VLOOKUP($P$3,$G$9:$I$15,3)","v":0},{"$f":"VLOOKUP($Q$3,$G$9:$I$15,3)","v":0},{"$f":"VLOOKUP($R$3,$G$9:$I$15,3)","v":0},{"$f":"VLOOKUP($S$3,$G$9:$I$15,3)","v":0},{"$f":"VLOOKUP($T$3,$G$9:$I$15,3)","v":0}]
["Stage 3     GN0078003",3,1.4]
["C/T           GN0078004   ","8 or 9",1.5]
["Monitor     GN0078005",4,1.4]
["Blank       GN0078006  ",0,0.4,null,null,null,0,0.4,0]
["TOTAL  (Quantity Must be 14)",null,null,{"$f":"SUM(G4:T4)","v":11.600000000000003},null,null,1,1.4,0.2]
[null,null,null,null,null,null,2,1.4,0.2]
["TEST CASSETTE [ Flash Test ]",null,null,null,null,null,3,1.4,0.2]
["Stage 1     GN0078001",1,0.2,null,null,null,4,1.4,0.2]
["Stage 2     GN0078002",2,0.2,null,null,null,8,1.5,0.2]
["Stage 3     GN0078003",3,0.2,null,null,null,9,1.5,0.2]
["C/T           GN0078004   ","8 or 9",0.2]
["Monitor     GN0078005",4,0.2]
[null,null,null,{"$f":"SUM(G5:T5)","v":1.2}]
[]
["FINAL ASSEMBLE"]
[null,null,"TIME "]
["Standard Time",null,6.25,1,{"$f":"C22*D22","v":6.25}]
["2 Way CT Link  GN2065001",null,0.11,{"$f":"Nomenclature!U7","v":0},{"$f":"C23*D23","v":0}]
["3 Way CT Link  GN2065002",null,0.13,{"$f":"Nomenclature!V7","v":0},0]
["4 Way CT Link  GN2065003",null,0.15,{"$f":"Nomenclature!W7","v":0},0]
["5 Way CT Link  GN2065004",null,0.16,{"$f":"Nomenclature!X7","v":0},0]
["6 Way CT Link  GN2065005",null,0.18,{"$f":"Nomenclature!Y7","v":0},0]
["7 Way CT Link  GN2065006",null,0.2,{"$f":"Nomenclature!Z7","v":0},0]
["8 Way CT Link  GN2065007",null,0.22,{"$f":"Nomenclature!AA7","v":0},0]
[9,null,0.24,{"$f":"Nomenclature!AB7","v":0},0]
[10,null,0.26,{"$f":"Nomenclature!AC7","v":0},0]
[11,null,0.28000000000000003,{"$f":"Nomenclature!AD7","v":0},0]
[12,null,0.3,{"$f":"Nomenclature!AE7","v":0},0]
[13,null,0.32,{"$f":"Nomenclature!AF7","v":0},0]
[14,null,0.34,{"$f":"Nomenclature!AG7","v":0},0]
[null,null,null,null,{"$f":"SUM(E22:E35)","v":6.25}]
[]
["Total   8's +  9  for number of ways"]
[]
["Function test & Prod    ",null,1.8]

{"sheet":"Database","index":9,"n_rows":706,"n_cols":59,"rows_kept":706,"cut":false,"hidden":true,"merged":[]}
["Ratings/Attributes","Key",{"$f":"'MIFAS Data'!$B$4","v":"P22222200000000D"},"SLOT # 1",null,null,null,"SLOT # 2",null,null,null,"SLOT # 3",null,null,null,"SLOT # 4",null,null,null,"SLOT # 5",null,null,null,"SLOT # 6",null,null,null,"SLOT # 7",null,null,null,"SLOT # 8",null,null,null,"SLOT # 9",null,null,null,"SLOT # 10",null,null,null,"SLOT # 11",null,null,null,"SLOT # 12",null,null,null,"SLOT # 13",null,null,null,"SLOT # 14"]
[null,null,"P11110022008889",1,"TO",4,"STAGE1",5,"AND",6,"ISOL",7,"AND",8,"STAGE2",9,"AND",10,"ISOL",11,"TO",14,"SHORT"," "," "," "," "," "," "," "," "," "," "," "," "," "," "," "," "," "," "," "," "," "," "," "," "," "," "," "," "," "," "," "," "," "," "," "," "]
[null,null,"P11111111111100",1,"TO",12,"STAGE1",13,"AND",14,"ISOL"," "," "," "," "," "," "," "," "," "," "," "," "," "," "," "," "," "," "," "," "," "," "," "," "," "," "," "," "," "," "," "," "," "," "," "," "," "," "," "," "," "," "," "," "," "," "," "," "]
[null,null,"P11111111111101",1,"TO",12,"STAGE1",13," "," ","ISOL",14," "," ","STAGE1"," "," "," "," "," "," "," "," "," "," "," "," "," "," "," "," "," "," "," "," "," "," "," "," "," "," "," "," "," "," "," "," "," "," "," "," "," "," "," "," "," "," "," "," "]
[null,null,"P11111111111102",1,"TO",12,"STAGE1",13," "," ","ISOL",14," "," ","STAGE2"," "," "," "," "," "," "," "," "," "," "," "," "," "," "," "," "," "," "," "," "," "," "," "," "," "," "," "," "," "," "," "," "," "," "," "," "," "," "," "," "," "," "," "," "]
[null,null,"P11111111111103",1,"TO",12,"STAGE1",13," "," ","ISOL",14," "," ","STAGE3"," "," "," "," "," "," "," "," "," "," "," "," "," "," "," "," "," "," "," "," "," "," "," "," "," "," "," "," "," "," "," "," "," "," "," "," "," "," "," "," "," "," "," "," "]
[null,null,"P11111111111104",1,"TO",12,"STAGE1",13," "," ","ISOL",14," "," ","MONIT"," "," "," "," "," "," "," "," "," "," "," "," "," "," "," "," "," "," "," "," "," "," "," "," "," "," "," "," "," "," "," "," "," "," "," "," "," "," "," "," "," "," "," "," "]
[null,null,"P11111111111110",1,"TO",13,"STAGE1",14," "," ","ISOL"," "," "," "," "," "," "," "," "," "," "," "," "," "," "," "," "," "," "," "," "," "," "," "," "," "," "," "," "," "," "," "," "," "," "," "," "," "," "," "," "," "," "," "," "," "," "," "," "]
[null,null,"P11111111111111",1,"TO",14,"STAGE1"," "," "," "," "," "," "," "," "," "," "," "," "," "," "," "," "," "," "," "," "," "," "," "," "," "," "," "," "," "," "," "," "," "," "," "," "," "," "," "," "," "," "," "," "," "," "," "," "," "," "," "," "]
[null,null,"P11111111111112",1,"TO",13,"STAGE1",14," "," ","STAGE2"," "," "," "," "," "," "," "," "," "," "," "," "," "," "," "," "," "," "," "," "," "," "," "," "," "," "," "," "," "," "," "," "," "," "," "," "," "," "," "," "," "," "," "," "," "," "," "," "]
[null,null,"P11111111111113",1,"TO",13,"STAGE1",14," "," ","STAGE3"," "," "," "," "," "," "," "," "," "," "," "," "," "," "," "," "," "," "," "," "," "," "," "," "," "," "," "," "," "," "," "," "," "," "," "," "," "," "," "," "," "," "," "," "," "," "," "," "]
[null,null,"P11111111111114",1,"TO",13,"STAGE1",14," "," ","MONIT"," "," "," "," "," "," "," "," "," "," "," "," "," "," "," "," "," "," "," "," "," "," "," "," "," "," "," "," "," "," "," "," "," "," "," "," "," "," "," "," "," "," "," "," "," "," "," "," "]
[null,null,"P11111111111120",1,"TO",12,"STAGE1",13," "," ","STAGE2",14," "," ","ISOL"," "," "," "," "," "," "," "," "," "," "," "," "," "," "," "," "," "," "," "," "," "," "," "," "," "," "," "," "," "," "," "," "," "," "," "," "," "," "," "," "," "," "," "," "]
[null,null,"P11111111111121",1,"TO",12,"STAGE1",13," "," ","STAGE2",14," "," ","STAGE1"," "," "," "," "," "," "," "," "," "," "," "," "," "," "," "," "," "," "," "," "," "," "," "," "," "," "," "," "," "," "," "," "," "," "," "," "," "," "," "," "," "," "," "," "]
[null,null,"P11111111111122",1,"TO",12,"STAGE1",13,"AND",14,"STAGE2"," "," "," "," "," "," "," "," "," "," "," "," "," "," "," "," "," "," "," "," "," "," "," "," "," "," "," "," "," "," "," "," "," "," "," "," "," "," "," "," "," "," "," "," "," "," "," "," "]
[null,null,"P11111111111123",1,"TO",12,"STAGE1",13," "," ","STAGE2",14," "," ","STAGE3"," "," "," "," "," "," "," "," "," "," "," "," "," "," "," "," "," "," "," "," "," "," "," "," "," "," "," "," "," "," "," "," "," "," "," "," "," "," "," "," "," "," "," "," "]
[null,null,"P11111111111124",1,"TO",12,"STAGE1",13," "," ","STAGE2",14," "," ","MONIT"," "," "," "," "," "," "," "," "," "," "," "," "," "," "," "," "," "," "," "," "," "," "," "," "," "," "," "," "," "," "," "," "," "," "," "," "," "," "," "," "," "," "," "," "]
[null,null,"P11111111111130",1,"TO",12,"STAGE1",13," "," ","STAGE3",14," "," ","ISOL"," "," "," "," "," "," "," "," "," "," "," "," "," "," "," "," "," "," "," "," "," "," "," "," "," "," "," "," "," "," "," "," "," "," "," "," "," "," "," "," "," "," "," "," "]
[null,null,"P11111111111131",1,"TO",12,"STAGE1",13," "," ","STAGE3",14," "," ","STAGE1"," "," "," "," "," "," "," "," "," "," "," "," "," "," "," "," "," "," "," "," "," "," "," "," "," "," "," "," "," "," "," "," "," "," "," "," "," "," "," "," "," "," "," "," "]
[null,null,"P11111111111132",1,"TO",12,"STAGE1",13," "," ","STAGE3",14," "," ","STAGE2"," "," "," "," "," "," "," "," "," "," "," "," "," "," "," "," "," "," "," "," "," "," "," "," "," "," "," "," "," "," "," "," "," "," "," "," "," "," "," "," "," "," "," "," "]
[null,null,"P11111111111133",1,"TO",12,"STAGE1",13,"AND",14,"STAGE3"," "," "," "," "," "," "," "," "," "," "," "," "," "," "," "," "," "," "," "," "," "," "," "," "," "," "," "," "," "," "," "," "," "," "," "," "," "," "," "," "," "," "," "," "," "," "," "," "]
[null,null,"P11111111111134",1,"TO",12,"STAGE1",13," "," ","STAGE3",14," "," ","MONIT"," "," "," "," "," "," "," "," "," "," "," "," "," "," "," "," "," "," "," "," "," "," "," "," "," "," "," "," "," "," "," "," "," "," "," "," "," "," "," "," "," "," "," "," "]
[null,null,"P11111111111140",1,"TO",12,"STAGE1",13," "," ","MONIT",14," "," ","ISOL"," "," "," "," "," "," "," "," "," "," "," "," "," "," "," "," "," "," "," "," "," "," "," "," "," "," "," "," "," "," "," "," "," "," "," "," "," "," "," "," "," "," "," "," "]
[null,null,"P11111111111141",1,"TO",12,"STAGE1",13," "," ","MONIT",14," "," ","STAGE1"," "," "," "," "," "," "," "," "," "," "," "," "," "," "," "," "," "," "," "," "," "," "," "," "," "," "," "," "," "," "," "," "," "," "," "," "," "," "," "," "," "," "," "," "]
[null,null,"P11111111111142",1,"TO",12,"STAGE1",13," "," ","MONIT",14," "," ","STAGE2"," "," "," "," "," "," "," "," "," "," "," "," "," "," "," "," "," "," "," "," "," "," "," "," "," "," "," "," "," "," "," "," "," "," "," "," "," "," "," "," "," "," "," "," "]
[null,null,"P11111111111143",1,"TO",12,"STAGE1",13," "," ","MONIT",14," "," ","STAGE3"," "," "," "," "," "," "," "," "," "," "," "," "," "," "," "," "," "," "," "," "," "," "," "," "," "," "," "," "," "," "," "," "," "," "," "," "," "," "," "," "," "," "," "," "]
[null,null,"P11111111111144",1,"TO",12,"STAGE1",13,"AND",14,"MONIT"," "," "," "," "," "," "," "," "," "," "," "," "," "," "," "," "," "," "," "," "," "," "," "," "," "," "," "," "," "," "," "," "," "," "," "," "," "," "," "," "," "," "," "," "," "," "," "," "]
[null,null,"P11111111111189",1,"TO",12,"STAGE1",13,"AND",14,"SHORT"," "," "," "," "," "," "," "," "," "," "," "," "," "," "," "," "," "," "," "," "," "," "," "," "," "," "," "," "," "," "," "," "," "," "," "," "," "," "," "," "," "," "," "," "," "," "," "," "]
[null,null,"P11111111111210",1,"TO",11,"STAGE1",12," "," ","STAGE2",13," "," ","STAGE1",14," "," ","ISOL"," "," "," "," "," "," "," "," "," "," "," "," "," "," "," "," "," "," "," "," "," "," "," "," "," "," "," "," "," "," "," "," "," "," "," "," "," "," "," "," "]
[null,null,"P11111111111211",1,"TO",11,"STAGE1",12," "," ","STAGE2",13,"AND",14,"STAGE1"," "," "," "," "," "," "," "," "," "," "," "," "," "," "," "," "," "," "," "," "," "," "," "," "," "," "," "," "," "," "," "," "," "," "," "," "," "," "," "," "," "," "," "," "]
[null,null,"P11111111111212",1,"TO",11,"STAGE1",12," "," ","STAGE2",13," "," ","STAGE1",14," "," ","STAGE2"," "," "," "," "," "," "," "," "," "," "," "," "," "," "," "," "," "," "," "," "," "," "," "," "," "," "," "," "," "," "," "," "," "," "," "," "," "," "," "," "]
[null,null,"P11111111111213",1,"TO",11,"STAGE1",12," "," ","STAGE2",13," "," ","STAGE1",14," "," ","STAGE3"," "," "," "," "," "," "," "," "," "," "," "," "," "," "," "," "," "," "," "," "," "," "," "," "," "," "," "," "," "," "," "," "," "," "," "," "," "," "," "," "]
[null,null,"P11111111111214",1,"TO",11,"STAGE1",12," "," ","STAGE2",13," "," ","STAGE1",14," "," ","MONIT"," "," "," "," "," "," "," "," "," "," "," "," "," "," "," "," "," "," "," "," "," "," "," "," "," "," "," "," "," "," "," "," "," "," "," "," "," "," "," "," "]
[null,null,"P11111111111889",1,"TO",11,"STAGE1",12,"TO",14,"SHORT"," "," "," "," "," "," "," "," "," "," "," "," "," "," "," "," "," "," "," "," "," "," "," "," "," "," "," "," "," "," "," "," "," "," "," "," "," "," "," "," "," "," "," "," "," "," "," "," "]
[null,null,"P11111111111890",1,"TO",11,"STAGE1",12,"AND",13,"SHORT",14," "," ","ISOL"," "," "," "," "," "," "," "," "," "," "," "," "," "," "," "," "," "," "," "," "," "," "," "," "," "," "," "," "," "," "," "," "," "," "," "," "," "," "," "," "," "," "," "," "]
[null,null,"P11111111111891",1,"TO",11,"STAGE1",12,"AND",13,"SHORT",14," "," ","STAGE1"," "," "," "," "," "," "," "," "," "," "," "," "," "," "," "," "," "," "," "," "," "," "," "," "," "," "," "," "," "," "," "," "," "," "," "," "," "," "," "," "," "," "," "," "]
[null,null,"P11111111111892",1,"TO",11,"STAGE1",12,"AND",13,"SHORT",14," "," ","STAGE2"," "," "," "," "," "," "," "," "," "," "," "," "," "," "," "," "," "," "," "," "," "," "," "," "," "," "," "," "," "," "," "," "," "," "," "," "," "," "," "," "," "," "," "," "]
[null,null,"P11111111111893",1,"TO",11,"STAGE1",12,"AND",13,"SHORT",14," "," ","STAGE3"," "," "," "," "," "," "," "," "," "," "," "," "," "," "," "," "," "," "," "," "," "," "," "," "," "," "," "," "," "," "," "," "," "," "," "," "," "," "," "," "," "," "," "," "]
[null,null,"P11111111111894",1,"TO",11,"STAGE1",12,"AND",13,"SHORT",14," "," ","MONIT"," "," "," "," "," "," "," "," "," "," "," "," "," "," "," "," "," "," "," "," "," "," "," "," "," "," "," "," "," "," "," "," "," "," "," "," "," "," "," "," "," "," "," "," "]
[null,null,"P11111111112000",1,"TO",10,"STAGE1",11," "," ","STAGE2",12,"TO",14,"ISOL"," "," "," "," "," "," "," "," "," "," "," "," "," "," "," "," "," "," "," "," "," "," "," "," "," "," "," "," "," "," "," "," "," "," "," "," "," "," "," "," "," "," "," "," "]
[null,null,"P11111111112001",1,"TO",10,"STAGE1",11," "," ","STAGE2",12,"TO",13,"ISOL",14," "," ","STAGE1"," "," "," "," "," "," "," "," "," "," "," "," "," "," "," "," "," "," "," "," "," "," "," "," "," "," "," "," "," "," "," "," "," "," "," "," "," "," "," "," "]
[null,null,"P11111111112002",1,"TO",10,"STAGE1",11," "," ","STAGE2",12,"TO",13,"ISOL",14," "," ","STAGE2"," "," "," "," "," "," "," "," "," "," "," "," "," "," "," "," "," "," "," "," "," "," "," "," "," "," "," "," "," "," "," "," "," "," "," "," "," "," "," "," "]
[null,null,"P11111111112003",1,"TO",10,"STAGE1",11," "," ","STAGE2",12,"TO",13,"ISOL",14," "," ","STAGE3"," "," "," "," "," "," "," "," "," "," "," "," "," "," "," "," "," "," "," "," "," "," "," "," "," "," "," "," "," "," "," "," "," "," "," "," "," "," "," "," "]
[null,null,"P11111111112004",1,"TO",10,"STAGE1",11," "," ","STAGE2",12,"TO",13,"ISOL",14," "," ","MONIT"," "," "," "," "," "," "," "," "," "," "," "," "," "," "," "," "," "," "," "," "," "," "," "," "," "," "," "," "," "," "," "," "," "," "," "," "," "," "," "," "]
[null,null,"P11111111112010",1,"TO",10,"STAGE1",11," "," ","STAGE2",12," "," ","ISOL",13," "," ","STAGE1",14," "," ","ISOL"," "," "," "," "," "," "," "," "," "," "," "," "," "," "," "," "," "," "," "," "," "," "," "," "," "," "," "," "," "," "," "," "," "," "," "," "]
[null,null,"P11111111112011",1,"TO",10,"STAGE1",11," "," ","STAGE2",12," "," ","ISOL",13,"AND",14,"ISOL"," "," "," "," "," "," "," "," "," "," "," "," "," "," "," "," "," "," "," "," "," "," "," "," "," "," "," "," "," "," "," "," "," "," "," "," "," "," "," "," "]
[null,null,"P11111111112012",1,"TO",10,"STAGE1",11," "," ","STAGE2",12," "," ","ISOL",13," "," ","STAGE1",14," "," ","STAGE2"," "," "," "," "," "," "," "," "," "," "," "," "," "," "," "," "," "," "," "," "," "," "," "," "," "," "," "," "," "," "," "," "," "," "," "," "]
[null,null,"P11111111112013",1,"TO",10,"STAGE1",11," "," ","STAGE2",12," "," ","ISOL",13," "," ","STAGE1",14," "," ","STAGE3"," "," "," "," "," "," "," "," "," "," "," "," "," "," "," "," "," "," "," "," "," "," "," "," "," "," "," "," "," "," "," "," "," "," "," "," "]
[null,null,"P11111111112014",1,"TO",10,"STAGE1",11," "," ","STAGE2",12," "," ","ISOL",13," "," ","STAGE1",14," "," ","MONIT"," "," "," "," "," "," "," "," "," "," "," "," "," "," "," "," "," "," "," "," "," "," "," "," "," "," "," "," "," "," "," "," "," "," "," "," "]
[null,null,"P11111111112020",1,"TO",10,"STAGE1",11," "," ","STAGE2",12," "," ","ISOL",13," "," ","STAGE2",14," "," ","ISOL"," "," "," "," "," "," "," "," "," "," "," "," "," "," "," "," "," "," "," "," "," "," "," "," "," "," "," "," "," "," "," "," "," "," "," "," "]
[null,null,"P11111111112021",1,"TO",10,"STAGE1",11," "," ","STAGE2",12," "," ","ISOL",13," "," ","STAGE2",14," "," ","STAGE1"," "," "," "," "," "," "," "," "," "," "," "," "," "," "," "," "," "," "," "," "," "," "," "," "," "," "," "," "," "," "," "," "," "," "," "," "]
[null,null,"P11111111112022",1,"TO",10,"STAGE1",11," "," ","STAGE2",12," "," ","ISOL",13,"AND",14,"STAGE2"," "," "," "," "," "," "," "," "," "," "," "," "," "," "," "," "," "," "," "," "," "," "," "," "," "," "," "," "," "," "," "," "," "," "," "," "," "," "," "," "]
[null,null,"P11111111112023",1,"TO",10,"STAGE1",11," "," ","STAGE2",12," "," ","ISOL",13," "," ","STAGE2",14," "," ","STAGE3"," "," "," "," "," "," "," "," "," "," "," "," "," "," "," "," "," "," "," "," "," "," "," "," "," "," "," "," "," "," "," "," "," "," "," "," "]
[null,null,"P11111111112024",1,"TO",10,"STAGE1",11," "," ","STAGE2",12," "," ","ISOL",13," "," ","STAGE2",14," "," ","MONIT"," "," "," "," "," "," "," "," "," "," "," "," "," "," "," "," "," "," "," "," "," "," "," "," "," "," "," "," "," "," "," "," "," "," "," "," "]
[null,null,"P11111111112030",1,"TO",10,"STAGE1",11," "," ","STAGE2",12," "," ","ISOL",13," "," ","STAGE3",14," "," ","ISOL"," "," "," "," "," "," "," "," "," "," "," "," "," "," "," "," "," "," "," "," "," "," "," "," "," "," "," "," "," "," "," "," "," "," "," "," "]
[null,null,"P11111111112031",1,"TO",10,"STAGE1",11," "," ","STAGE2",12," "," ","ISOL",13," "," ","STAGE3",14," "," ","STAGE1"," "," "," "," "," "," "," "," "," "," "," "," "," "," "," "," "," "," "," "," "," "," "," "," "," "," "," "," "," "," "," "," "," "," "," "," "]
[null,null,"P11111111112032",1,"TO",10,"STAGE1",11," "," ","STAGE2",12," "," ","ISOL",13," "," ","STAGE3",14," "," ","STAGE2"," "," "," "," "," "," "," "," "," "," "," "," "," "," "," "," "," "," "," "," "," "," "," "," "," "," "," "," "," "," "," "," "," "," "," "," "]
[null,null,"P11111111112033",1,"TO",10,"STAGE1",11," "," ","STAGE2",12," "," ","ISOL",13,"AND",14,"STAGE3"," "," "," "," "," "," "," "," "," "," "," "," "," "," "," "," "," "," "," "," "," "," "," "," "," "," "," "," "," "," "," "," "," "," "," "," "," "," "," "," "]
[null,null,"P11111111112034",1,"TO",10,"STAGE1",11," "," ","STAGE2",12," "," ","ISOL",13," "," ","STAGE3",14," "," ","MONIT"," "," "," "," "," "," "," "," "," "," "," "," "," "," "," "," "," "," "," "," "," "," "," "," "," "," "," "," "," "," "," "," "," "," "," "," "]
[null,null,"P11111111112040",1,"TO",10,"STAGE1",11," "," ","STAGE2",12," "," ","ISOL",13," "," ","MONIT",14," "," ","ISOL"," "," "," "," "," "," "," "," "," "," "," "," "," "," "," "," "," "," "," "," "," "," "," "," "," "," "," "," "," "," "," "," "," "," "," "," "]
[null,null,"P11111111112041",1,"TO",10,"STAGE1",11," "," ","STAGE2",12," "," ","ISOL",13," "," ","MONIT",14," "," ","STAGE1"," "," "," "," "," "," "," "," "," "," "," "," "," "," "," "," "," "," "," "," "," "," "," "," "," "," "," "," "," "," "," "," "," "," "," "," "]
[null,null,"P11111111112042",1,"TO",10,"STAGE1",11," "," ","STAGE2",12," "," ","ISOL",13," "," ","MONIT",14," "," ","STAGE2"," "," "," "," "," "," "," "," "," "," "," "," "," "," "," "," "," "," "," "," "," "," "," "," "," "," "," "," "," "," "," "," "," "," "," "," "]
[null,null,"P11111111112043",1,"TO",10,"STAGE1",11," "," ","STAGE2",12," "," ","ISOL",13," "," ","MONIT",14," "," ","STAGE3"," "," "," "," "," "," "," "," "," "," "," "," "," "," "," "," "," "," "," "," "," "," "," "," "," "," "," "," "," "," "," "," "," "," "," "," "]
[null,null,"P11111111112044",1,"TO",10,"STAGE1",11," "," ","STAGE2",12," "," ","ISOL",13,"AND",14,"MONIT"," "," "," "," "," "," "," "," "," "," "," "," "," "," "," "," "," "," "," "," "," "," "," "," "," "," "," "," "," "," "," "," "," "," "," "," "," "," "," "," "]
[null,null,"P11111111112100",1,"TO",10,"STAGE1",11," "," ","STAGE2",12," "," ","STAGE1",13,"AND",14,"ISOL"," "," "," "," "," "," "," "," "," "," "," "," "," "," "," "," "," "," "," "," "," "," "," "," "," "," "," "," "," "," "," "," "," "," "," "," "," "," "," "," "]
[null,null,"P11111111112101",1,"TO",10,"STAGE1",11," "," ","STAGE2",12," "," ","STAGE1",13," "," ","ISOL",14," "," ","STAGE1"," "," "," "," "," "," "," "," "," "," "," "," "," "," "," "," "," "," "," "," "," "," "," "," "," "," "," "," "," "," "," "," "," "," "," "," "]
[null,null,"P11111111112102",1,"TO",10,"STAGE1",11," "," ","STAGE2",12," "," ","STAGE1",13," "," ","ISOL",14," "," ","STAGE2"," "," "," "," "," "," "," "," "," "," "," "," "," "," "," "," "," "," "," "," "," "," "," "," "," "," "," "," "," "," "," "," "," "," "," "," "]
[null,null,"P11111111112103",1,"TO",10,"STAGE1",11," "," ","STAGE2",12," "," ","STAGE1",13," "," ","ISOL",14," "," ","STAGE3"," "," "," "," "," "," "," "," "," "," "," "," "," "," "," "," "," "," "," "," "," "," "," "," "," "," "," "," "," "," "," "," "," "," "," "," "]
[null,null,"P11111111112104",1,"TO",10,"STAGE1",11," "," ","STAGE2",12," "," ","STAGE1",13," "," ","ISOL",14," "," ","MONIT"," "," "," "," "," "," "," "," "," "," "," "," "," "," "," "," "," "," "," "," "," "," "," "," "," "," "," "," "," "," "," "," "," "," "," "," "]
[null,null,"P11111111112110",1,"TO",10,"STAGE1",11," "," ","STAGE2",12,"AND",13,"STAGE1",14," "," ","ISOL"," "," "," "," "," "," "," "," "," "," "," "," "," "," "," "," "," "," "," "," "," "," "," "," "," "," "," "," "," "," "," "," "," "," "," "," "," "," "," "," "]
[null,null,"P11111111112111",1,"TO",10,"STAGE1",11," "," ","STAGE2",12,"TO",14,"STAGE1"," "," "," "," "," "," "," "," "," "," "," "," "," "," "," "," "," "," "," "," "," "," "," "," "," "," "," "," "," "," "," "," "," "," "," "," "," "," "," "," "," "," "," "," "]
[null,null,"P11111111112112",1,"TO",10,"STAGE1",11," "," ","STAGE2",12,"AND",13,"STAGE1",14," "," ","STAGE2"," "," "," "," "," "," "," "," "," "," "," "," "," "," "," "," "," "," "," "," "," "," "," "," "," "," "," "," "," "," "," "," "," "," "," "," "," "," "," "," "]
[null,null,"P11111111112113",1,"TO",10,"STAGE1",11," "," ","STAGE2",12,"AND",13,"STAGE1",14," "," ","STAGE3"," "," "," "," "," "," "," "," "," "," "," "," "," "," "," "," "," "," "," "," "," "," "," "," "," "," "," "," "," "," "," "," "," "," "," "," "," "," "," "," "]
[null,null,"P11111111112114",1,"TO",10,"STAGE1",11," "," ","STAGE2",12,"AND",13,"STAGE1",14," "," ","MONIT"," "," "," "," "," "," "," "," "," "," "," "," "," "," "," "," "," "," "," "," "," "," "," "," "," "," "," "," "," "," "," "," "," "," "," "," "," "," "," "," "]
[null,null,"P11111111112200",1,"TO",10,"STAGE1",11,"AND",12,"STAGE2",13,"AND",14,"ISOL"," "," "," "," "," "," "," "," "," "," "," "," "," "," "," "," "," "," "," "," "," "," "," "," "," "," "," "," "," "," "," "," "," "," "," "," "," "," "," "," "," "," "," "," "]
[null,null,"P11111111112201",1,"TO",10,"STAGE1",11,"AND",12,"STAGE2",13," "," ","ISOL",14," "," ","STAGE1"," "," "," "," "," "," "," "," "," "," "," "," "," "," "," "," "," "," "," "," "," "," "," "," "," "," "," "," "," "," "," "," "," "," "," "," "," "," "," "," "]
[null,null,"P11111111112202",1,"TO",10,"STAGE1",11,"AND",12,"STAGE2",13," "," ","ISOL",14," "," ","STAGE2"," "," "," "," "," "," "," "," "," "," "," "," "," "," "," "," "," "," "," "," "," "," "," "," "," "," "," "," "," "," "," "," "," "," "," "," "," "," "," "," "]
[null,null,"P11111111112203",1,"TO",10,"STAGE1",11,"AND",12,"STAGE2",13," "," ","ISOL",14," "," ","STAGE3"," "," "," "," "," "," "," "," "," "," "," "," "," "," "," "," "," "," "," "," "," "," "," "," "," "," "," "," "," "," "," "," "," "," "," "," "," "," "," "," "]
[null,null,"P11111111112204",1,"TO",10,"STAGE1",11,"AND",12,"STAGE2",13," "," ","ISOL",14," "," ","MONIT"," "," "," "," "," "," "," "," "," "," "," "," "," "," "," "," "," "," "," "," "," "," "," "," "," "," "," "," "," "," "," "," "," "," "," "," "," "," "," "," "]
[null,null,"P11111111112300",1,"TO",10,"STAGE1",11," "," ","STAGE2",12," "," ","STAGE3",13,"AND",14,"ISOL"," "," "," "," "," "," "," "," "," "," "," "," "," "," "," "," "," "," "," "," "," "," "," "," "," "," "," "," "," "," "," "," "," "," "," "," "," "," "," "," "]
[null,null,"P11111111112301",1,"TO",10,"STAGE1",11," "," ","STAGE2",12," "," ","STAGE3",13," "," ","ISOL",14," "," ","STAGE1"," "," "," "," "," "," "," "," "," "," "," "," "," "," "," "," "," "," "," "," "," "," "," "," "," "," "," "," "," "," "," "," "," "," "," "," "]
[null,null,"P11111111112302",1,"TO",10,"STAGE1",11," "," ","STAGE2",12," "," ","STAGE3",13," "," ","ISOL",14," "," ","STAGE2"," "," "," "," "," "," "," "," "," "," "," "," "," "," "," "," "," "," "," "," "," "," "," "," "," "," "," "," "," "," "," "," "," "," "," "," "]
[null,null,"P11111111112303",1,"TO",10,"STAGE1",11," "," ","STAGE2",12," "," ","STAGE3",13," "," ","ISOL",14," "," ","STAGE3"," "," "," "," "," "," "," "," "," "," "," "," "," "," "," "," "," "," "," "," "," "," "," "," "," "," "," "," "," "," "," "," "," "," "," "," "]
[null,null,"P11111111112304",1,"TO",10,"STAGE1",11," "," ","STAGE2",12," "," ","STAGE3",13," "," ","ISOL",14," "," ","MONIT"," "," "," "," "," "," "," "," "," "," "," "," "," "," "," "," "," "," "," "," "," "," "," "," "," "," "," "," "," "," "," "," "," "," "," "," "]
[null,null,"P11111111112310",1,"TO",10,"STAGE1",11," "," ","STAGE2",12," "," ","STAGE3",13," "," ","STAGE1",14," "," ","ISOL"," "," "," "," "," "," "," "," "," "," "," "," "," "," "," "," "," "," "," "," "," "," "," "," "," "," "," "," "," "," "," "," "," "," "," "," "]
[null,null,"P11111111112311",1,"TO",10,"STAGE1",11," "," ","STAGE2",12," "," ","STAGE3",13,"AND",14,"STAGE1"," "," "," "," "," "," "," "," "," "," "," "," "," "," "," "," "," "," "," "," "," "," "," "," "," "," "," "," "," "," "," "," "," "," "," "," "," "," "," "," "]
[null,null,"P11111111112312",1,"TO",10,"STAGE1",11," "," ","STAGE2",12," "," ","STAGE3",13," "," ","STAGE1",14," "," ","STAGE2"," "," "," "," "," "," "," "," "," "," "," "," "," "," "," "," "," "," "," "," "," "," "," "," "," "," "," "," "," "," "," "," "," "," "," "," "]
[null,null,"P11111111112313",1,"TO",10,"STAGE1",11," "," ","STAGE2",12," "," ","STAGE3",13," "," ","STAGE1",14," "," ","STAGE3"," "," "," "," "," "," "," "," "," "," "," "," "," "," "," "," "," "," "," "," "," "," "," "," "," "," "," "," "," "," "," "," "," "," "," "," "]
[null,null,"P11111111112314",1,"TO",10,"STAGE1",11," "," ","STAGE2",12," "," ","STAGE3",13," "," ","STAGE1",14," "," ","MONIT"," "," "," "," "," "," "," "," "," "," "," "," "," "," "," "," "," "," "," "," "," "," "," "," "," "," "," "," "," "," "," "," "," "," "," "," "]
[null,null,"P11111111112320",1,"TO",10,"STAGE1",11," "," ","STAGE2",12," "," ","STAGE3",13," "," ","STAGE2",14," "," ","ISOL"," "," "," "," "," "," "," "," "," "," "," "," "," "," "," "," "," "," "," "," "," "," "," "," "," "," "," "," "," "," "," "," "," "," "," "," "]
[null,null,"P11111111112321",1,"TO",10,"STAGE1",11," "," ","STAGE2",12," "," ","STAGE3",13," "," ","STAGE2",14," "," ","STAGE1"," "," "," "," "," "," "," "," "," "," "," "," "," "," "," "," "," "," "," "," "," "," "," "," "," "," "," "," "," "," "," "," "," "," "," "," "]
[null,null,"P11111111112322",1,"TO",10,"STAGE1",11," "," ","STAGE2",12," "," ","STAGE3",13,"AND",14,"STAGE2"," "," "," "," "," "," "," "," "," "," "," "," "," "," "," "," "," "," "," "," "," "," "," "," "," "," "," "," "," "," "," "," "," "," "," "," "," "," "," "," "]
[null,null,"P11111111112323",1,"TO",10,"STAGE1",11," "," ","STAGE2",12," "," ","STAGE3",13," "," ","STAGE2",14," "," ","STAGE3"," "," "," "," "," "," "," "," "," "," "," "," "," "," "," "," "," "," "," "," "," "," "," "," "," "," "," "," "," "," "," "," "," "," "," "," "]
[null,null,"P11111111112324",1,"TO",10,"STAGE1",11," "," ","STAGE2",12," "," ","STAGE3",13," "," ","STAGE2",14," "," ","MONIT"," "," "," "," "," "," "," "," "," "," "," "," "," "," "," "," "," "," "," "," "," "," "," "," "," "," "," "," "," "," "," "," "," "," "," "," "]
[null,null,"P11111111112330",1,"TO",10,"STAGE1",11," "," ","STAGE2",12,"AND",13,"STAGE3",14," "," ","ISOL"," "," "," "," "," "," "," "," "," "," "," "," "," "," "," "," "," "," "," "," "," "," "," "," "," "," "," "," "," "," "," "," "," "," "," "," "," "," "," "," "]
[null,null,"P11111111112331",1,"TO",10,"STAGE1",11," "," ","STAGE2",12,"AND",13,"STAGE3",14," "," ","STAGE1"," "," "," "," "," "," "," "," "," "," "," "," "," "," "," "," "," "," "," "," "," "," "," "," "," "," "," "," "," "," "," "," "," "," "," "," "," "," "," "," "]
[null,null,"P11111111112332",1,"TO",10,"STAGE1",11," "," ","STAGE2",12,"AND",13,"STAGE3",14," "," ","STAGE2"," "," "," "," "," "," "," "," "," "," "," "," "," "," "," "," "," "," "," "," "," "," "," "," "," "," "," "," "," "," "," "," "," "," "," "," "," "," "," "," "]
[null,null,"P11111111112333",1,"TO",10,"STAGE1",11," "," ","STAGE2",12,"TO",14,"STAGE3"," "," "," "," "," "," "," "," "," "," "," "," "," "," "," "," "," "," "," "," "," "," "," "," "," "," "," "," "," "," "," "," "," "," "," "," "," "," "," "," "," "," "," "," "]
[null,null,"P11111111112334",1,"TO",10,"STAGE1",11," "," ","STAGE2",12,"AND",14,"STAGE3",14," "," ","MONIT"," "," "," "," "," "," "," "," "," "," "," "," "," "," "," "," "," "," "," "," "," "," "," "," "," "," "," "," "," "," "," "," "," "," "," "," "," "," "," "," "]
[null,null,"P11111111112340",1,"TO",10,"STAGE1",11," "," ","STAGE2",12," "," ","STAGE3",13," "," ","MONIT",14," "," ","ISOL"," "," "," "," "," "," "," "," "," "," "," "," "," "," "," "," "," "," "," "," "," "," "," "," "," "," "," "," "," "," "," "," "," "," "," "," "]
[null,null,"P11111111112341",1,"TO",10,"STAGE1",11," "," ","STAGE2",12," "," ","STAGE3",13," "," ","MONIT",14," "," ","STAGE1"," "," "," "," "," "," "," "," "," "," "," "," "," "," "," "," "," "," "," "," "," "," "," "," "," "," "," "," "," "," "," "," "," "," "," "," "]
[null,null,"P11111111112342",1,"TO",10,"STAGE1",11," "," ","STAGE2",12," "," ","STAGE3",13," "," ","MONIT",14," "," ","STAGE2"," "," "," "," "," "," "," "," "," "," "," "," "," "," "," "," "," "," "," "," "," "," "," "," "," "," "," "," "," "," "," "," "," "," "," "," "]
[null,null,"P11111111112343",1,"TO",10,"STAGE1",11," "," ","STAGE2",12," "," ","STAGE3",13," "," ","MONIT",14," "," ","STAGE3"," "," "," "," "," "," "," "," "," "," "," "," "," "," "," "," "," "," "," "," "," "," "," "," "," "," "," "," "," "," "," "," "," "," "," "," "]
[null,null,"P11111111112344",1,"TO",10,"STAGE1",11," "," ","STAGE2",12," "," ","STAGE3",13,"AND",14,"MONIT"," "," "," "," "," "," "," "," "," "," "," "," "," "," "," "," "," "," "," "," "," "," "," "," "," "," "," "," "," "," "," "," "," "," "," "," "," "," "," "," "]
[null,null,"P11111111112410",1,"TO",10,"STAGE1",11," "," ","STAGE2",12," "," ","MONIT",13," "," ","STAGE1",14," "," ","ISOL"," "," "," "," "," "," "," "," "," "," "," "," "," "," "," "," "," "," "," "," "," "," "," "," "," "," "," "," "," "," "," "," "," "," "," "," "]
[null,null,"P11111111112411",1,"TO",10,"STAGE1",11," "," ","STAGE2",12," "," ","MONIT",13,"AND",14,"ISOL"," "," "," "," "," "," "," "," "," "," "," "," "," "," "," "," "," "," "," "," "," "," "," "," "," "," "," "," "," "," "," "," "," "," "," "," "," "," "," "," "]
[null,null,"P11111111112412",1,"TO",10,"STAGE1",11," "," ","STAGE2",12," "," ","MONIT",13," "," ","STAGE1",14," "," ","STAGE2"," "," "," "," "," "," "," "," "," "," "," "," "," "," "," "," "," "," "," "," "," "," "," "," "," "," "," "," "," "," "," "," "," "," "," "," "]
[null,null,"P11111111112413",1,"TO",10,"STAGE1",11," "," ","STAGE2",12," "," ","MONIT",13," "," ","STAGE1",14," "," ","STAGE3"," "," "," "," "," "," "," "," "," "," "," "," "," "," "," "," "," "," "," "," "," "," "," "," "," "," "," "," "," "," "," "," "," "," "," "," "]
[null,null,"P11111111112414",1,"TO",10,"STAGE1",11," "," ","STAGE2",12," "," ","MONIT",13," "," ","STAGE1",14," "," ","MONIT"," "," "," "," "," "," "," "," "," "," "," "," "," "," "," "," "," "," "," "," "," "," "," "," "," "," "," "," "," "," "," "," "," "," "," "," "]
[null,null,"P11111111112420",1,"TO",10,"STAGE1",11," "," ","STAGE2",12," "," ","MONIT",13," "," ","STAGE2",14," "," ","ISOL"," "," "," "," "," "," "," "," "," "," "," "," "," "," "," "," "," "," "," "," "," "," "," "," "," "," "," "," "," "," "," "," "," "," "," "," "]
[null,null,"P11111111112421",1,"TO",10,"STAGE1",11," "," ","STAGE2",12," "," ","MONIT",13," "," ","STAGE2",14," "," ","STAGE1"," "," "," "," "," "," "," "," "," "," "," "," "," "," "," "," "," "," "," "," "," "," "," "," "," "," "," "," "," "," "," "," "," "," "," "," "]
[null,null,"P11111111112422",1,"TO",10,"STAGE1",11," "," ","STAGE2",12," "," ","MONIT",13,"AND",14,"STAGE2"," "," "," "," "," "," "," "," "," "," "," "," "," "," "," "," "," "," "," "," "," "," "," "," "," "," "," "," "," "," "," "," "," "," "," "," "," "," "," "," "]
[null,null,"P11111111112423",1,"TO",10,"STAGE1",11," "," ","STAGE2",12," "," ","MONIT",13," "," ","STAGE2",14," "," ","STAGE3"," "," "," "," "," "," "," "," "," "," "," "," "," "," "," "," "," "," "," "," "," "," "," "," "," "," "," "," "," "," "," "," "," "," "," "," "]
[null,null,"P11111111112424",1,"TO",10,"STAGE1",11," "," ","STAGE2",12," "," ","MONIT",13," "," ","STAGE2",14," "," ","MONIT"," "," "," "," "," "," "," "," "," "," "," "," "," "," "," "," "," "," "," "," "," "," "," "," "," "," "," "," "," "," "," "," "," "," "," "," "]
[null,null,"P11111111112430",1,"TO",10,"STAGE1",11," "," ","STAGE2",12," "," ","MONIT",13," "," ","STAGE3",14," "," ","ISOL"," "," "," "," "," "," "," "," "," "," "," "," "," "," "," "," "," "," "," "," "," "," "," "," "," "," "," "," "," "," "," "," "," "," "," "," "]
[null,null,"P11111111112431",1,"TO",10,"STAGE1",11," "," ","STAGE2",12," "," ","MONIT",13," "," ","STAGE3",14," "," ","STAGE1"," "," "," "," "," "," "," "," "," "," "," "," "," "," "," "," "," "," "," "," "," "," "," "," "," "," "," "," "," "," "," "," "," "," "," "," "]
[null,null,"P11111111112432",1,"TO",10,"STAGE1",11," "," ","STAGE2",12," "," ","MONIT",13," "," ","STAGE3",14," "," ","STAGE2"," "," "," "," "," "," "," "," "," "," "," "," "," "," "," "," "," "," "," "," "," "," "," "," "," "," "," "," "," "," "," "," "," "," "," "," "]
[null,null,"P11111111112433",1,"TO",10,"STAGE1",11," "," ","STAGE2",12," "," ","MONIT",13,"AND",14,"STAGE3"," "," "," "," "," "," "," "," "," "," "," "," "," "," "," "," "," "," "," "," "," "," "," "," "," "," "," "," "," "," "," "," "," "," "," "," "," "," "," "," "]
[null,null,"P11111111112434",1,"TO",10,"STAGE1",11," "," ","STAGE2",12," "," ","MONIT",13," "," ","STAGE3",14," "," ","MONIT"," "," "," "," "," "," "," "," "," "," "," "," "," "," "," "," "," "," "," "," "," "," "," "," "," "," "," "," "," "," "," "," "," "," "," "," "]
[null,null,"P11111111112440",1,"TO",10,"STAGE1",11," "," ","STAGE2",12,"AND",13,"MONIT",14," "," ","ISOL"," "," "," "," "," "," "," "," "," "," "," "," "," "," "," "," "," "," "," "," "," "," "," "," "," "," "," "," "," "," "," "," "," "," "," "," "," "," "," "," "]
[null,null,"P11111111112441",1,"TO",10,"STAGE1",11," "," ","STAGE2",12,"AND",13,"MONIT",14," "," ","STAGE1"," "," "," "," "," "," "," "," "," "," "," "," "," "," "," "," "," "," "," "," "," "," "," "," "," "," "," "," "," "," "," "," "," "," "," "," "," "," "," "," "]
[null,null,"P11111111112442",1,"TO",10,"STAGE1",11," "," ","STAGE2",12,"AND",13,"MONIT",14," "," ","STAGE2"," "," "," "," "," "," "," "," "," "," "," "," "," "," "," "," "," "," "," "," "," "," "," "," "," "," "," "," "," "," "," "," "," "," "," "," "," "," "," "," "]
[null,null,"P11111111112443",1,"TO",10,"STAGE1",11," "," ","STAGE2",12,"AND",13,"MONIT",14," "," ","STAGE3"," "," "," "," "," "," "," "," "," "," "," "," "," "," "," "," "," "," "," "," "," "," "," "," "," "," "," "," "," "," "," "," "," "," "," "," "," "," "," "," "]
[null,null,"P11111111112444",1,"TO",10,"STAGE1",11," "," ","STAGE2",12,"TO",14,"MONIT"," "," "," "," "," "," "," "," "," "," "," "," "," "," "," "," "," "," "," "," "," "," "," "," "," "," "," "," "," "," "," "," "," "," "," "," "," "," "," "," "," "," "," "," "]
[null,null,"P11111111112489",1,"TO",10,"STAGE1",11," "," ","STAGE2",12," "," ","MONIT",13,"AND",14,"SHORT"," "," "," "," "," "," "," "," "," "," "," "," "," "," "," "," "," "," "," "," "," "," "," "," "," "," "," "," "," "," "," "," "," "," "," "," "," "," "," "," "]
[null,null,"P11111111113000",1,"TO",10,"STAGE1",11," "," ","STAGE3",12,"TO",14,"ISOL"," "," "," "," "," "," "," "," "," "," "," "," "," "," "," "," "," "," "," "," "," "," "," "," "," "," "," "," "," "," "," "," "," "," "," "," "," "," "," "," "," "," "," "," "]
[null,null,"P11111111113001",1,"TO",10,"STAGE1",11," "," ","STAGE3",12,"AND",13,"ISOL",14," "," ","STAGE1"," "," "," "," "," "," "," "," "," "," "," "," "," "," "," "," "," "," "," "," "," "," "," "," "," "," "," "," "," "," "," "," "," "," "," "," "," "," "," "," "]
[null,null,"P11111111113002",1,"TO",10,"STAGE1",11," "," ","STAGE3",12,"AND",13,"ISOL",14," "," ","STAGE2"," "," "," "," "," "," "," "," "," "," "," "," "," "," "," "," "," "," "," "," "," "," "," "," "," "," "," "," "," "," "," "," "," "," "," "," "," "," "," "," "]
[null,null,"P11111111113003",1,"TO",10,"STAGE1",11," "," ","STAGE3",12,"AND",13,"ISOL",14," "," ","STAGE3"," "," "," "," "," "," "," "," "," "," "," "," "," "," "," "," "," "," "," "," "," "," "," "," "," "," "," "," "," "," "," "," "," "," "," "," "," "," "," "," "]
[null,null,"P11111111113004",1,"TO",10,"STAGE1",11," "," ","STAGE3",12,"AND",13,"ISOL",14," "," ","MONIT"," "," "," "," "," "," "," "," "," "," "," "," "," "," "," "," "," "," "," "," "," "," "," "," "," "," "," "," "," "," "," "," "," "," "," "," "," "," "," "," "]
[null,null,"P11111111113010",1,"TO",10,"STAGE1",11," "," ","STAGE3",12," "," ","ISOL",13," "," ","STAGE1",14," "," ","ISOL"," "," "," "," "," "," "," "," "," "," "," "," "," "," "," "," "," "," "," "," "," "," "," "," "," "," "," "," "," "," "," "," "," "," "," "," "]
[null,null,"P11111111113011",1,"TO",10,"STAGE1",11," "," ","STAGE3",12," "," ","ISOL",13,"AND",14,"STAGE1"," "," "," "," "," "," "," "," "," "," "," "," "," "," "," "," "," "," "," "," "," "," "," "," "," "," "," "," "," "," "," "," "," "," "," "," "," "," "," "," "]
[null,null,"P11111111113012",1,"TO",10,"STAGE1",11," "," ","STAGE3",12," "," ","ISOL",13," "," ","STAGE1",14," "," ","STAGE2"," "," "," "," "," "," "," "," "," "," "," "," "," "," "," "," "," "," "," "," "," "," "," "," "," "," "," "," "," "," "," "," "," "," "," "," "]
[null,null,"P11111111113013",1,"TO",10,"STAGE1",11," "," ","STAGE3",12," "," ","ISOL",13," "," ","STAGE1",14," "," ","STAGE3"," "," "," "," "," "," "," "," "," "," "," "," "," "," "," "," "," "," "," "," "," "," "," "," "," "," "," "," "," "," "," "," "," "," "," "," "]
[null,null,"P11111111113014",1,"TO",10,"STAGE1",11," "," ","STAGE3",12," "," ","ISOL",13," "," ","STAGE1",14," "," ","MONIT"," "," "," "," "," "," "," "," "," "," "," "," "," "," "," "," "," "," "," "," "," "," "," "," "," "," "," "," "," "," "," "," "," "," "," "," "]
[null,null,"P11111111113020",1,"TO",10,"STAGE1",11," "," ","STAGE3",12," "," ","ISOL",13," "," ","STAGE2",14," "," ","ISOL"," "," "," "," "," "," "," "," "," "," "," "," "," "," "," "," "," "," "," "," "," "," "," "," "," "," "," "," "," "," "," "," "," "," "," "," "]
[null,null,"P11111111113021",1,"TO",10,"STAGE1",11," "," ","STAGE3",12," "," ","ISOL",13," "," ","STAGE2",14," "," ","STAGE1"," "," "," "," "," "," "," "," "," "," "," "," "," "," "," "," "," "," "," "," "," "," "," "," "," "," "," "," "," "," "," "," "," "," "," "," "]
[null,null,"P11111111113022",1,"TO",10,"STAGE1",11," "," ","STAGE3",12," "," ","ISOL",13,"AND",14,"STAGE2"," "," "," "," "," "," "," "," "," "," "," "," "," "," "," "," "," "," "," "," "," "," "," "," "," "," "," "," "," "," "," "," "," "," "," "," "," "," "," "," "]
[null,null,"P11111111113023",1,"TO",10,"STAGE1",11," "," ","STAGE3",12," "," ","ISOL",13," "," ","STAGE2",14," "," ","STAGE3"," "," "," "," "," "," "," "," "," "," "," "," "," "," "," "," "," "," "," "," "," "," "," "," "," "," "," "," "," "," "," "," "," "," "," "," "]
[null,null,"P11111111113024",1,"TO",10,"STAGE1",11," "," ","STAGE3",12," "," ","ISOL",13," "," ","STAGE2",14," "," ","MONIT"," "," "," "," "," "," "," "," "," "," "," "," "," "," "," "," "," "," "," "," "," "," "," "," "," "," "," "," "," "," "," "," "," "," "," "," "]
[null,null,"P11111111113030",1,"TO",10,"STAGE1",11," "," ","STAGE3",12," "," ","ISOL",13," "," ","STAGE3",14," "," ","ISOL"," "," "," "," "," "," "," "," "," "," "," "," "," "," "," "," "," "," "," "," "," "," "," "," "," "," "," "," "," "," "," "," "," "," "," "," "]
[null,null,"P11111111113031",1,"TO",10,"STAGE1",11," "," ","STAGE3",12," "," ","ISOL",13," "," ","STAGE3",14," "," ","STAGE1"," "," "," "," "," "," "," "," "," "," "," "," "," "," "," "," "," "," "," "," "," "," "," "," "," "," "," "," "," "," "," "," "," "," "," "," "]
[null,null,"P11111111113032",1,"TO",10,"STAGE1",11," "," ","STAGE3",12," "," ","ISOL",13," "," ","STAGE3",14," "," ","STAGE2"," "," "," "," "," "," "," "," "," "," "," "," "," "," "," "," "," "," "," "," "," "," "," "," "," "," "," "," "," "," "," "," "," "," "," "," "]
[null,null,"P11111111113033",1,"TO",10,"STAGE1",11," "," ","STAGE3",12," "," ","ISOL",13,"AND",14,"STAGE3"," "," "," "," "," "," "," "," "," "," "," "," "," "," "," "," "," "," "," "," "," "," "," "," "," "," "," "," "," "," "," "," "," "," "," "," "," "," "," "," "]
[null,null,"P11111111113034",1,"TO",10,"STAGE1",11," "," ","STAGE3",12," "," ","ISOL",13," "," ","STAGE3",14," "," ","MONIT"," "," "," "," "," "," "," "," "," "," "," "," "," "," "," "," "," "," "," "," "," "," "," "," "," "," "," "," "," "," "," "," "," "," "," "," "]
[null,null,"P11111111113040",1,"TO",10,"STAGE1",11," "," ","STAGE3",12," "," ","ISOL",13," "," ","MONIT",14," "," ","ISOL"," "," "," "," "," "," "," "," "," "," "," "," "," "," "," "," "," "," "," "," "," "," "," "," "," "," "," "," "," "," "," "," "," "," "," "," "]
[null,null,"P11111111113041",1,"TO",10,"STAGE1",11," "," ","STAGE3",12," "," ","ISOL",13," "," ","MONIT",14," "," ","STAGE1"," "," "," "," "," "," "," "," "," "," "," "," "," "," "," "," "," "," "," "," "," "," "," "," "," "," "," "," "," "," "," "," "," "," "," "," "]
[null,null,"P11111111113042",1,"TO",10,"STAGE1",11," "," ","STAGE3",12," "," ","ISOL",13," "," ","MONIT",14," "," ","STAGE2"," "," "," "," "," "," "," "," "," "," "," "," "," "," "," "," "," "," "," "," "," "," "," "," "," "," "," "," "," "," "," "," "," "," "," "," "]
[null,null,"P11111111113043",1,"TO",10,"STAGE1",11," "," ","STAGE3",12," "," ","ISOL",13," "," ","MONIT",14," "," ","STAGE3"," "," "," "," "," "," "," "," "," "," "," "," "," "," "," "," "," "," "," "," "," "," "," "," "," "," "," "," "," "," "," "," "," "," "," "," "]
[null,null,"P11111111113044",1,"TO",10,"STAGE1",11," "," ","STAGE3",12," "," ","ISOL",13,"AND",14,"MONIT"," "," "," "," "," "," "," "," "," "," "," "," "," "," "," "," "," "," "," "," "," "," "," "," "," "," "," "," "," "," "," "," "," "," "," "," "," "," "," "," "]
[null,null,"P11111111113100",1,"TO",10,"STAGE1",11," "," ","STAGE3",12," "," ","STAGE1",13,"AND",14,"ISOL"," "," "," "," "," "," "," "," "," "," "," "," "," "," "," "," "," "," "," "," "," "," "," "," "," "," "," "," "," "," "," "," "," "," "," "," "," "," "," "," "]
[null,null,"P11111111113101",1,"TO",10,"STAGE1",11," "," ","STAGE3",12," "," ","STAGE1",13," "," ","ISOL",14," "," ","STAGE1"," "," "," "," "," "," "," "," "," "," "," "," "," "," "," "," "," "," "," "," "," "," "," "," "," "," "," "," "," "," "," "," "," "," "," "," "]
[null,null,"P11111111113102",1,"TO",10,"STAGE1",11," "," ","STAGE3",12," "," ","STAGE1",13," "," ","ISOL",14," "," ","STAGE2"," "," "," "," "," "," "," "," "," "," "," "," "," "," "," "," "," "," "," "," "," "," "," "," "," "," "," "," "," "," "," "," "," "," "," "," "]
[null,null,"P11111111113103",1,"TO",10,"STAGE1",11," "," ","STAGE3",12," "," ","STAGE1",13," "," ","ISOL",14," "," ","STAGE3"," "," "," "," "," "," "," "," "," "," "," "," "," "," "," "," "," "," "," "," "," "," "," "," "," "," "," "," "," "," "," "," "," "," "," "," "]
[null,null,"P11111111113104",1,"TO",10,"STAGE1",11," "," ","STAGE3",12," "," ","STAGE1",13," "," ","ISOL",14," "," ","MONIT"," "," "," "," "," "," "," "," "," "," "," "," "," "," "," "," "," "," "," "," "," "," "," "," "," "," "," "," "," "," "," "," "," "," "," "," "]
[null,null,"P11111111113110",1,"TO",10,"STAGE1",11," "," ","STAGE3",12,"AND",13,"STAGE1",14," "," ","ISOL"," "," "," "," "," "," "," "," "," "," "," "," "," "," "," "," "," "," "," "," "," "," "," "," "," "," "," "," "," "," "," "," "," "," "," "," "," "," "," "," "]
[null,null,"P11111111113111",1,"TO",10,"STAGE1",11," "," ","STAGE3",12,"TO",14,"STAGE1"," "," "," "," "," "," "," "," "," "," "," "," "," "," "," "," "," "," "," "," "," "," "," "," "," "," "," "," "," "," "," "," "," "," "," "," "," "," "," "," "," "," "," "," "]
[null,null,"P11111111113112",1,"TO",10,"STAGE1",11," "," ","STAGE3",12,"AND",13,"STAGE1",14," "," ","STAGE2"," "," "," "," "," "," "," "," "," "," "," "," "," "," "," "," "," "," "," "," "," "," "," "," "," "," "," "," "," "," "," "," "," "," "," "," "," "," "," "," "]
[null,null,"P11111111113113",1,"TO",10,"STAGE1",11," "," ","STAGE3",12,"AND",13,"STAGE1",14," "," ","STAGE3"," "," "," "," "," "," "," "," "," "," "," "," "," "," "," "," "," "," "," "," "," "," "," "," "," "," "," "," "," "," "," "," "," "," "," "," "," "," "," "," "]
[null,null,"P11111111113114",1,"TO",10,"STAGE1",11," "," ","STAGE3",12,"AND",13,"STAGE1",14," "," ","MONIT"," "," "," "," "," "," "," "," "," "," "," "," "," "," "," "," "," "," "," "," "," "," "," "," "," "," "," "," "," "," "," "," "," "," "," "," "," "," "," "," "]
[null,null,"P11111111113120",1,"TO",10,"STAGE1",11," "," ","STAGE3",12," "," ","STAGE1",13," "," ","STAGE2",14," "," ","ISOL"," "," "," "," "," "," "," "," "," "," "," "," "," "," "," "," "," "," "," "," "," "," "," "," "," "," "," "," "," "," "," "," "," "," "," "," "]
[null,null,"P11111111113121",1,"TO",10,"STAGE1",11," "," ","STAGE3",12," "," ","STAGE1",13," "," ","STAGE2",14," "," ","STAGE1"," "," "," "," "," "," "," "," "," "," "," "," "," "," "," "," "," "," "," "," "," "," "," "," "," "," "," "," "," "," "," "," "," "," "," "," "]
[null,null,"P11111111113122",1,"TO",10,"STAGE1",11," "," ","STAGE3",12," "," ","STAGE1",13,"AND",14,"STAGE2"," "," "," "," "," "," "," "," "," "," "," "," "," "," "," "," "," "," "," "," "," "," "," "," "," "," "," "," "," "," "," "," "," "," "," "," "," "," "," "," "]
[null,null,"P11111111113123",1,"TO",10,"STAGE1",11," "," ","STAGE3",12," "," ","STAGE1",13," "," ","STAGE2",14," "," ","STAGE3"," "," "," "," "," "," "," "," "," "," "," "," "," "," "," "," "," "," "," "," "," "," "," "," "," "," "," "," "," "," "," "," "," "," "," "," "]
[null,null,"P11111111113124",1,"TO",10,"STAGE1",11," "," ","STAGE3",12," "," ","STAGE1",13," "," ","STAGE2",14," "," ","ISOL"," "," "," "," "," "," "," "," "," "," "," "," "," "," "," "," "," "," "," "," "," "," "," "," "," "," "," "," "," "," "," "," "," "," "," "," "]
[null,null,"P11111111113130",1,"TO",10,"STAGE1",11," "," ","STAGE3",12," "," ","STAGE1",13," "," ","STAGE3",14," "," ","ISOL"," "," "," "," "," "," "," "," "," "," "," "," "," "," "," "," "," "," "," "," "," "," "," "," "," "," "," "," "," "," "," "," "," "," "," "," "]
[null,null,"P11111111113131",1,"TO",10,"STAGE1",11," "," ","STAGE3",12," "," ","STAGE1",13," "," ","STAGE3",14," "," ","STAGE1"," "," "," "," "," "," "," "," "," "," "," "," "," "," "," "," "," "," "," "," "," "," "," "," "," "," "," "," "," "," "," "," "," "," "," "," "]
[null,null,"P11111111113132",1,"TO",10,"STAGE1",11," "," ","STAGE3",12," "," ","STAGE1",13," "," ","STAGE3",14," "," ","STAGE2"," "," "," "," "," "," "," "," "," "," "," "," "," "," "," "," "," "," "," "," "," "," "," "," "," "," "," "," "," "," "," "," "," "," "," "," "]
[null,null,"P11111111113133",1,"TO",10,"STAGE1",11," "," ","STAGE3",12," "," ","STAGE1",13,"AND",14,"STAGE3"," "," "," "," "," "," "," "," "," "," "," "," "," "," "," "," "," "," "," "," "," "," "," "," "," "," "," "," "," "," "," "," "," "," "," "," "," "," "," "," "]
[null,null,"P11111111113134",1,"TO",10,"STAGE1",11," "," ","STAGE3",12," "," ","STAGE1",13," "," ","STAGE3",14," "," ","MONIT"," "," "," "," "," "," "," "," "," "," "," "," "," "," "," "," "," "," "," "," "," "," "," "," "," "," "," "," "," "," "," "," "," "," "," "," "]
[null,null,"P11111111113140",1,"TO",10,"STAGE1",11," "," ","STAGE3",12," "," ","STAGE1",13," "," ","MONIT",14," "," ","ISOL"," "," "," "," "," "," "," "," "," "," "," "," "," "," "," "," "," "," "," "," "," "," "," "," "," "," "," "," "," "," "," "," "," "," "," "," "]
[null,null,"P11111111113141",1,"TO",10,"STAGE1",11," "," ","STAGE3",12," "," ","STAGE1",13," "," ","MONIT",14," "," ","STAGE1"," "," "," "," "," "," "," "," "," "," "," "," "," "," "," "," "," "," "," "," "," "," "," "," "," "," "," "," "," "," "," "," "," "," "," "," "]
[null,null,"P11111111113142",1,"TO",10,"STAGE1",11," "," ","STAGE3",12," "," ","STAGE1",13," "," ","MONIT",14," "," ","STAGE2"," "," "," "," "," "," "," "," "," "," "," "," "," "," "," "," "," "," "," "," "," "," "," "," "," "," "," "," "," "," "," "," "," "," "," "," "]
[null,null,"P11111111113143",1,"TO",10,"STAGE1",11," "," ","STAGE3",12," "," ","STAGE1",13," "," ","MONIT",14," "," ","STAGE3"," "," "," "," "," "," "," "," "," "," "," "," "," "," "," "," "," "," "," "," "," "," "," "," "," "," "," "," "," "," "," "," "," "," "," "," "]
[null,null,"P11111111113144",1,"TO",10,"STAGE1",11," "," ","STAGE3",12," "," ","STAGE1",13,"AND",14,"MONIT"," "," "," "," "," "," "," "," "," "," "," "," "," "," "," "," "," "," "," "," "," "," "," "," "," "," "," "," "," "," "," "," "," "," "," "," "," "," "," "," "]
[null,null,"P11111111113189",1,"TO",10,"STAGE1",11," "," ","STAGE3",12," "," ","STAGE1",13,"AND",14,"SHORT"," "," "," "," "," "," "," "," "," "," "," "," "," "," "," "," "," "," "," "," "," "," "," "," "," "," "," "," "," "," "," "," "," "," "," "," "," "," "," "," "]
[null,null,"P11111111113200",1,"TO",10,"STAGE1",11," "," ","STAGE3",12," "," ","STAGE2",13,"AND",14,"ISOL"," "," "," "," "," "," "," "," "," "," "," "," "," "," "," "," "," "," "," "," "," "," "," "," "," "," "," "," "," "," "," "," "," "," "," "," "," "," "," "," "]
[null,null,"P11111111113201",1,"TO",10,"STAGE1",11," "," ","STAGE3",12," "," ","STAGE2",13," "," ","ISOL",14," "," ","STAGE1"," "," "," "," "," "," "," "," "," "," "," "," "," "," "," "," "," "," "," "," "," "," "," "," "," "," "," "," "," "," "," "," "," "," "," "," "]
[null,null,"P11111111113202",1,"TO",10,"STAGE1",11," "," ","STAGE3",12," "," ","STAGE2",13," "," ","ISOL",14," "," ","STAGE2"," "," "," "," "," "," "," "," "," "," "," "," "," "," "," "," "," "," "," "," "," "," "," "," "," "," "," "," "," "," "," "," "," "," "," "," "]
[null,null,"P11111111113203",1,"TO",10,"STAGE1",11," "," ","STAGE3",12," "," ","STAGE2",13," "," ","ISOL",14," "," ","STAGE3"," "," "," "," "," "," "," "," "," "," "," "," "," "," "," "," "," "," "," "," "," "," "," "," "," "," "," "," "," "," "," "," "," "," "," "," "]
[null,null,"P11111111113204",1,"TO",10,"STAGE1",11," "," ","STAGE3",12," "," ","STAGE2",13," "," ","ISOL",14," "," ","MONIT"," "," "," "," "," "," "," "," "," "," "," "," "," "," "," "," "," "," "," "," "," "," "," "," "," "," "," "," "," "," "," "," "," "," "," "," "]
[null,null,"P11111111113210",1,"TO",10,"STAGE1",11," "," ","STAGE3",12," "," ","STAGE2",13," "," ","STAGE1",14," "," ","ISOL"," "," "," "," "," "," "," "," "," "," "," "," "," "," "," "," "," "," "," "," "," "," "," "," "," "," "," "," "," "," "," "," "," "," "," "," "]
[null,null,"P11111111113211",1,"TO",10,"STAGE1",11," "," ","STAGE3",12," "," ","STAGE2",13,"AND",14,"STAGE1"," "," "," "," "," "," "," "," "," "," "," "," "," "," "," "," "," "," "," "," "," "," "," "," "," "," "," "," "," "," "," "," "," "," "," "," "," "," "," "," "]
[null,null,"P11111111113212",1,"TO",10,"STAGE1",11," "," ","STAGE3",12," "," ","STAGE2",13," "," ","STAGE1",14," "," ","STAGE2"," "," "," "," "," "," "," "," "," "," "," "," "," "," "," "," "," "," "," "," "," "," "," "," "," "," "," "," "," "," "," "," "," "," "," "," "]
[null,null,"P11111111113213",1,"TO",10,"STAGE1",11," "," ","STAGE3",12," "," ","STAGE2",13," "," ","STAGE1",14," "," ","STAGE3"," "," "," "," "," "," "," "," "," "," "," "," "," "," "," "," "," "," "," "," "," "," "," "," "," "," "," "," "," "," "," "," "," "," "," "," "]
[null,null,"P11111111113214",1,"TO",10,"STAGE1",11," "," ","STAGE3",12," "," ","STAGE2",13," "," ","STAGE1",14," "," ","MONIT"," "," "," "," "," "," "," "," "," "," "," "," "," "," "," "," "," "," "," "," "," "," "," "," "," "," "," "," "," "," "," "," "," "," "," "," "]
[null,null,"P11111111113220",1,"TO",10,"STAGE1",11," "," ","STAGE3",12,"AND",13,"STAGE2",14," "," ","ISOL"," "," "," "," "," "," "," "," "," "," "," "," "," "," "," "," "," "," "," "," "," "," "," "," "," "," "," "," "," "," "," "," "," "," "," "," "," "," "," "," "]
[null,null,"P11111111113221",1,"TO",10,"STAGE1",11," "," ","STAGE3",12,"AND",13,"STAGE2",14," "," ","STAGE1"," "," "," "," "," "," "," "," "," "," "," "," "," "," "," "," "," "," "," "," "," "," "," "," "," "," "," "," "," "," "," "," "," "," "," "," "," "," "," "," "]
[null,null,"P11111111113222",1,"TO",10,"STAGE1",11," "," ","STAGE3",12,"TO",14,"STAGE2"," "," "," "," "," "," "," "," "," "," "," "," "," "," "," "," "," "," "," "," "," "," "," "," "," "," "," "," "," "," "," "," "," "," "," "," "," "," "," "," "," "," "," "," "]
[null,null,"P11111111113223",1,"TO",10,"STAGE1",11," "," ","STAGE3",12,"AND",13,"STAGE2",14," "," ","STAGE3"," "," "," "," "," "," "," "," "," "," "," "," "," "," "," "," "," "," "," "," "," "," "," "," "," "," "," "," "," "," "," "," "," "," "," "," "," "," "," "," "]
[null,null,"P11111111113224",1,"TO",10,"STAGE1",11," "," ","STAGE3",12,"AND",13,"STAGE2",14," "," ","MONIT"," "," "," "," "," "," "," "," "," "," "," "," "," "," "," "," "," "," "," "," "," "," "," "," "," "," "," "," "," "," "," "," "," "," "," "," "," "," "," "," "]
[null,null,"P11111111113230",1,"TO",10,"STAGE1",11," "," ","STAGE3",12," "," ","STAGE2",13," "," ","STAGE3",14," "," ","ISOL"," "," "," "," "," "," "," "," "," "," "," "," "," "," "," "," "," "," "," "," "," "," "," "," "," "," "," "," "," "," "," "," "," "," "," "," "]
[null,null,"P11111111113231",1,"TO",10,"STAGE1",11," "," ","STAGE3",12," "," ","STAGE2",13," "," ","STAGE3",14," "," ","STAGE1"," "," "," "," "," "," "," "," "," "," "," "," "," "," "," "," "," "," "," "," "," "," "," "," "," "," "," "," "," "," "," "," "," "," "," "," "]
[null,null,"P11111111113232",1,"TO",10,"STAGE1",11," "," ","STAGE3",12," "," ","STAGE2",13," "," ","STAGE3",14," "," ","STAGE2"," "," "," "," "," "," "," "," "," "," "," "," "," "," "," "," "," "," "," "," "," "," "," "," "," "," "," "," "," "," "," "," "," "," "," "," "]
[null,null,"P11111111113233",1,"TO",10,"STAGE1",11," "," ","STAGE3",12," "," ","STAGE2",13,"AND",14,"STAGE3"," "," "," "," "," "," "," "," "," "," "," "," "," "," "," "," "," "," "," "," "," "," "," "," "," "," "," "," "," "," "," "," "," "," "," "," "," "," "," "," "]
[null,null,"P11111111113234",1,"TO",10,"STAGE1",11," "," ","STAGE3",12," "," ","STAGE2",13," "," ","STAGE3",14," "," ","MONIT"," "," "," "," "," "," "," "," "," "," "," "," "," "," "," "," "," "," "," "," "," "," "," "," "," "," "," "," "," "," "," "," "," "," "," "," "]
[null,null,"P11111111113240",1,"TO",10,"STAGE1",11," "," ","STAGE3",12," "," ","STAGE2",13," "," ","MONIT",14," "," ","ISOL"," "," "," "," "," "," "," "," "," "," "," "," "," "," "," "," "," "," "," "," "," "," "," "," "," "," "," "," "," "," "," "," "," "," "," "," "]
[null,null,"P11111111113241",1,"TO",10,"STAGE1",11," "," ","STAGE3",12," "," ","STAGE2",13," "," ","MONIT",14," "," ","STAGE1"," "," "," "," "," "," "," "," "," "," "," "," "," "," "," "," "," "," "," "," "," "," "," "," "," "," "," "," "," "," "," "," "," "," "," "," "]
[null,null,"P11111111113242",1,"TO",10,"STAGE1",11," "," ","STAGE3",12," "," ","STAGE2",13," "," ","MONIT",14," "," ","STAGE2"," "," "," "," "," "," "," "," "," "," "," "," "," "," "," "," "," "," "," "," "," "," "," "," "," "," "," "," "," "," "," "," "," "," "," "," "]
[null,null,"P11111111113243",1,"TO",10,"STAGE1",11," "," ","STAGE3",12," "," ","STAGE2",13," "," ","MONIT",14," "," ","STAGE3"," "," "," "," "," "," "," "," "," "," "," "," "," "," "," "," "," "," "," "," "," "," "," "," "," "," "," "," "," "," "," "," "," "," "," "," "]
[null,null,"P11111111113244",1,"TO",10,"STAGE1",11," "," ","STAGE3",12," "," ","STAGE2",13,"AND",14,"MONIT"," "," "," "," "," "," "," "," "," "," "," "," "," "," "," "," "," "," "," "," "," "," "," "," "," "," "," "," "," "," "," "," "," "," "," "," "," "," "," "," "]
[null,null,"P11111111113289",1,"TO",10,"STAGE1",11," "," ","STAGE3",12," "," ","STAGE2",13,"AND",14,"SHORT"," "," "," "," "," "," "," "," "," "," "," "," "," "," "," "," "," "," "," "," "," "," "," "," "," "," "," "," "," "," "," "," "," "," "," "," "," "," "," "," "]
[null,null,"P11111111113300",1,"TO",10,"STAGE1",11,"AND",12,"STAGE3",13,"AND",14,"ISOL"," "," "," "," "," "," "," "," "," "," "," "," "," "," "," "," "," "," "," "," "," "," "," "," "," "," "," "," "," "," "," "," "," "," "," "," "," "," "," "," "," "," "," "," "]
[null,null,"P11111111113301",1,"TO",10,"STAGE1",11,"AND",12,"STAGE3",13," "," ","ISOL",14," "," ","STAGE1"," "," "," "," "," "," "," "," "," "," "," "," "," "," "," "," "," "," "," "," "," "," "," "," "," "," "," "," "," "," "," "," "," "," "," "," "," "," "," "," "]
[null,null,"P11111111113302",1,"TO",10,"STAGE1",11,"AND",12,"STAGE3",13," "," ","ISOL",14," "," ","STAGE2"," "," "," "," "," "," "," "," "," "," "," "," "," "," "," "," "," "," "," "," "," "," "," "," "," "," "," "," "," "," "," "," "," "," "," "," "," "," "," "," "]
[null,null,"P11111111113303",1,"TO",10,"STAGE1",11,"AND",12,"STAGE3",13," "," ","ISOL",14," "," ","STAGE3"," "," "," "," "," "," "," "," "," "," "," "," "," "," "," "," "," "," "," "," "," "," "," "," "," "," "," "," "," "," "," "," "," "," "," "," "," "," "," "," "]
[null,null,"P11111111113304",1,"TO",10,"STAGE1",11,"AND",12,"STAGE3",13," "," ","ISOL",14," "," ","MONIT"," "," "," "," "," "," "," "," "," "," "," "," "," "," "," "," "," "," "," "," "," "," "," "," "," "," "," "," "," "," "," "," "," "," "," "," "," "," "," "," "]
[null,null,"P11111111113310",1,"TO",10,"STAGE1",11,"AND",12,"STAGE3",13," "," ","STAGE1",14," "," ","ISOL"," "," "," "," "," "," "," "," "," "," "," "," "," "," "," "," "," "," "," "," "," "," "," "," "," "," "," "," "," "," "," "," "," "," "," "," "," "," "," "," "]
[null,null,"P11111111113311",1,"TO",10,"STAGE1",11,"AND",12,"STAGE3",13,"AND",14,"STAGE1"," "," "," "," "," "," "," "," "," "," "," "," "," "," "," "," "," "," "," "," "," "," "," "," "," "," "," "," "," "," "," "," "," "," "," "," "," "," "," "," "," "," "," "," "]
[null,null,"P11111111113312",1,"TO",10,"STAGE1",11,"AND",12,"STAGE3",13," "," ","STAGE1",14," "," ","STAGE2"," "," "," "," "," "," "," "," "," "," "," "," "," "," "," "," "," "," "," "," "," "," "," "," "," "," "," "," "," "," "," "," "," "," "," "," "," "," "," "," "]
[null,null,"P11111111113313",1,"TO",10,"STAGE1",11,"AND",12,"STAGE3",13," "," ","STAGE1",14," "," ","STAGE3"," "," "," "," "," "," "," "," "," "," "," "," "," "," "," "," "," "," "," "," "," "," "," "," "," "," "," "," "," "," "," "," "," "," "," "," "," "," "," "," "]
[null,null,"P11111111113314",1,"TO",10,"STAGE1",11,"AND",12,"STAGE3",13," "," ","STAGE1",14," "," ","MONIT"," "," "," "," "," "," "," "," "," "," "," "," "," "," "," "," "," "," "," "," "," "," "," "," "," "," "," "," "," "," "," "," "," "," "," "," "," "," "," "," "]
[null,null,"P11111111113320",1,"TO",10,"STAGE1",11,"AND",12,"STAGE3",13," "," ","STAGE2",14," "," ","ISOL"," "," "," "," "," "," "," "," "," "," "," "," "," "," "," "," "," "," "," "," "," "," "," "," "," "," "," "," "," "," "," "," "," "," "," "," "," "," "," "," "]
[null,null,"P11111111113321",1,"TO",10,"STAGE1",11,"AND",12,"STAGE3",13," "," ","STAGE2",14," "," ","STAGE1"," "," "," "," "," "," "," "," "," "," "," "," "," "," "," "," "," "," "," "," "," "," "," "," "," "," "," "," "," "," "," "," "," "," "," "," "," "," "," "," "]
[null,null,"P11111111113322",1,"TO",10,"STAGE1",11,"AND",12,"STAGE3",13,"AND",14,"STAGE2"," "," "," "," "," "," "," "," "," "," "," "," "," "," "," "," "," "," "," "," "," "," "," "," "," "," "," "," "," "," "," "," "," "," "," "," "," "," "," "," "," "," "," "," "]
[null,null,"P11111111113323",1,"TO",10,"STAGE1",11,"AND",12,"STAGE3",13," "," ","STAGE2",14," "," ","STAGE3"," "," "," "," "," "," "," "," "," "," "," "," "," "," "," "," "," "," "," "," "," "," "," "," "," "," "," "," "," "," "," "," "," "," "," "," "," "," "," "," "]
[null,null,"P11111111113324",1,"TO",10,"STAGE1",11,"AND",12,"STAGE3",13," "," ","STAGE2",14," "," ","MONIT"," "," "," "," "," "," "," "," "," "," "," "," "," "," "," "," "," "," "," "," "," "," "," "," "," "," "," "," "," "," "," "," "," "," "," "," "," "," "," "," "]
[null,null,"P11111111113330",1,"TO",10,"STAGE1",11,"TO",13,"STAGE3",14," "," ","ISOL"," "," "," "," "," "," "," "," "," "," "," "," "," "," "," "," "," "," "," "," "," "," "," "," "," "," "," "," "," "," "," "," "," "," "," "," "," "," "," "," "," "," "," "," "]
[null,null,"P11111111113331",1,"TO",10,"STAGE1",11,"TO",13,"STAGE3",14," "," ","STAGE1"," "," "," "," "," "," "," "," "," "," "," "," "," "," "," "," "," "," "," "," "," "," "," "," "," "," "," "," "," "," "," "," "," "," "," "," "," "," "," "," "," "," "," "," "]
[null,null,"P11111111113332",1,"TO",10,"STAGE1",11,"TO",13,"STAGE3",14," "," ","STAGE2"," "," "," "," "," "," "," "," "," "," "," "," "," "," "," "," "," "," "," "," "," "," "," "," "," "," "," "," "," "," "," "," "," "," "," "," "," "," "," "," "," "," "," "," "]
[null,null,"P11111111113333",1,"TO",10,"STAGE1",11,"TO",14,"STAGE3"," "," "," "," "," "," "," "," "," "," "," "," "," "," "," "," "," "," "," "," "," "," "," "," "," "," "," "," "," "," "," "," "," "," "," "," "," "," "," "," "," "," "," "," "," "," "," "," "]
[null,null,"P11111111113334",1,"TO",10,"STAGE1",11,"TO",13,"STAGE3",14," "," ","MONIT"," "," "," "," "," "," "," "," "," "," "," "," "," "," "," "," "," "," "," "," "," "," "," "," "," "," "," "," "," "," "," "," "," "," "," "," "," "," "," "," "," "," "," "," "]
[null,null,"P11111111113340",1,"TO",10,"STAGE1",11,"AND",12,"STAGE3",13," "," ","MONIT",14," "," ","ISOL"," "," "," "," "," "," "," "," "," "," "," "," "," "," "," "," "," "," "," "," "," "," "," "," "," "," "," "," "," "," "," "," "," "," "," "," "," "," "," "," "]
[null,null,"P11111111113341",1,"TO",10,"STAGE1",11,"AND",12,"STAGE3",13," "," ","MONIT",14," "," ","STAGE1"," "," "," "," "," "," "," "," "," "," "," "," "," "," "," "," "," "," "," "," "," "," "," "," "," "," "," "," "," "," "," "," "," "," "," "," "," "," "," "," "]
[null,null,"P11111111113342",1,"TO",10,"STAGE1",11,"AND",12,"STAGE3",13," "," ","MONIT",14," "," ","STAGE2"," "," "," "," "," "," "," "," "," "," "," "," "," "," "," "," "," "," "," "," "," "," "," "," "," "," "," "," "," "," "," "," "," "," "," "," "," "," "," "," "]
[null,null,"P11111111113343",1,"TO",10,"STAGE1",11,"AND",12,"STAGE3",13," "," ","MONIT",14," "," ","STAGE3"," "," "," "," "," "," "," "," "," "," "," "," "," "," "," "," "," "," "," "," "," "," "," "," "," "," "," "," "," "," "," "," "," "," "," "," "," "," "," "," "]
[null,null,"P11111111113344",1,"TO",10,"STAGE1",11,"AND",12,"STAGE3",13,"AND",14,"MONIT"," "," "," "," "," "," "," "," "," "," "," "," "," "," "," "," "," "," "," "," "," "," "," "," "," "," "," "," "," "," "," "," "," "," "," "," "," "," "," "," "," "," "," "," "]
[null,null,"P11111111113389",1,"TO",10,"STAGE1",11,"AND",12,"STAGE3",13,"AND",14,"SHORT"," "," "," "," "," "," "," "," "," "," "," "," "," "," "," "," "," "," "," "," "," "," "," "," "," "," "," "," "," "," "," "," "," "," "," "," "," "," "," "," "," "," "," "," "]
[null,null,"P11111111113400",1,"TO",10,"STAGE1",11," "," ","STAGE3",12," "," ","MONIT",13,"AND",14,"ISOL"," "," "," "," "," "," "," "," "," "," "," "," "," "," "," "," "," "," "," "," "," "," "," "," "," "," "," "," "," "," "," "," "," "," "," "," "," "," "," "," "]
[null,null,"P11111111113401",1,"TO",10,"STAGE1",11," "," ","STAGE3",12," "," ","MONIT",13," "," ","ISOL",14," "," ","STAGE1"," "," "," "," "," "," "," "," "," "," "," "," "," "," "," "," "," "," "," "," "," "," "," "," "," "," "," "," "," "," "," "," "," "," "," "," "]
[null,null,"P11111111113402",1,"TO",10,"STAGE1",11," "," ","STAGE3",12," "," ","MONIT",13," "," ","ISOL",14," "," ","STAGE2"," "," "," "," "," "," "," "," "," "," "," "," "," "," "," "," "," "," "," "," "," "," "," "," "," "," "," "," "," "," "," "," "," "," "," "," "]
[null,null,"P11111111113403",1,"TO",10,"STAGE1",11," "," ","STAGE3",12," "," ","MONIT",13," "," ","ISOL",14," "," ","STAGE3"," "," "," "," "," "," "," "," "," "," "," "," "," "," "," "," "," "," "," "," "," "," "," "," "," "," "," "," "," "," "," "," "," "," "," "," "]
[null,null,"P11111111113404",1,"TO",10,"STAGE1",11," "," ","STAGE3",12," "," ","MONIT",13," "," ","ISOL",14," "," ","MONIT"," "," "," "," "," "," "," "," "," "," "," "," "," "," "," "," "," "," "," "," "," "," "," "," "," "," "," "," "," "," "," "," "," "," "," "," "]
[null,null,"P11111111113410",1,"TO",10,"STAGE1",11," "," ","STAGE3",12," "," ","MONIT",13," "," ","STAGE1",14," "," ","ISOL"," "," "," "," "," "," "," "," "," "," "," "," "," "," "," "," "," "," "," "," "," "," "," "," "," "," "," "," "," "," "," "," "," "," "," "," "]
[null,null,"P11111111113411",1,"TO",10,"STAGE1",11," "," ","STAGE3",12," "," ","MONIT",13,"AND",14,"STAGE1"," "," "," "," "," "," "," "," "," "," "," "," "," "," "," "," "," "," "," "," "," "," "," "," "," "," "," "," "," "," "," "," "," "," "," "," "," "," "," "," "]
[null,null,"P11111111113412",1,"TO",10,"STAGE1",11," "," ","STAGE3",12," "," ","MONIT",13," "," ","STAGE1",14," "," ","STAGE2"," "," "," "," "," "," "," "," "," "," "," "," "," "," "," "," "," "," "," "," "," "," "," "," "," "," "," "," "," "," "," "," "," "," "," "," "]
[null,null,"P11111111113413",1,"TO",10,"STAGE1",11," "," ","STAGE3",12," "," ","MONIT",13," "," ","STAGE1",14," "," ","STAGE3"," "," "," "," "," "," "," "," "," "," "," "," "," "," "," "," "," "," "," "," "," "," "," "," "," "," "," "," "," "," "," "," "," "," "," "," "]
[null,null,"P11111111113414",1,"TO",10,"STAGE1",11," "," ","STAGE3",12," "," ","MONIT",13," "," ","STAGE1",14," "," ","MONIT"," "," "," "," "," "," "," "," "," "," "," "," "," "," "," "," "," "," "," "," "," "," "," "," "," "," "," "," "," "," "," "," "," "," "," "," "]
[null,null,"P11111111113420",1,"TO",10,"STAGE1",11," "," ","STAGE3",12," "," ","MONIT",13," "," ","STAGE2",14," "," ","ISOL"," "," "," "," "," "," "," "," "," "," "," "," "," "," "," "," "," "," "," "," "," "," "," "," "," "," "," "," "," "," "," "," "," "," "," "," "]
[null,null,"P11111111113421",1,"TO",10,"STAGE1",11," "," ","STAGE3",12," "," ","MONIT",13," "," ","STAGE2",14," "," ","STAGE1"," "," "," "," "," "," "," "," "," "," "," "," "," "," "," "," "," "," "," "," "," "," "," "," "," "," "," "," "," "," "," "," "," "," "," "," "]
[null,null,"P11111111113422",1,"TO",10,"STAGE1",11," "," ","STAGE3",12," "," ","MONIT",13,"AND",14,"STAGE2"," "," "," "," "," "," "," "," "," "," "," "," "," "," "," "," "," "," "," "," "," "," "," "," "," "," "," "," "," "," "," "," "," "," "," "," "," "," "," "," "]
[null,null,"P11111111113423",1,"TO",10,"STAGE1",11," "," ","STAGE3",12," "," ","MONIT",13," "," ","STAGE2",14," "," ","STAGE3"," "," "," "," "," "," "," "," "," "," "," "," "," "," "," "," "," "," "," "," "," "," "," "," "," "," "," "," "," "," "," "," "," "," "," "," "]
[null,null,"P11111111113424",1,"TO",10,"STAGE1",11," "," ","STAGE3",12," "," ","MONIT",13," "," ","STAGE2",14," "," ","MONIT"," "," "," "," "," "," "," "," "," "," "," "," "," "," "," "," "," "," "," "," "," "," "," "," "," "," "," "," "," "," "," "," "," "," "," "," "]
[null,null,"P11111111113430",1,"TO",10,"STAGE1",11," "," ","STAGE3",12," "," ","MONIT",13," "," ","STAGE3",14," "," ","ISOL"," "," "," "," "," "," "," "," "," "," "," "," "," "," "," "," "," "," "," "," "," "," "," "," "," "," "," "," "," "," "," "," "," "," "," "," "]
[null,null,"P11111111113431",1,"TO",10,"STAGE1",11," "," ","STAGE3",12," "," ","MONIT",13," "," ","STAGE3",14," "," ","STAGE1"," "," "," "," "," "," "," "," "," "," "," "," "," "," "," "," "," "," "," "," "," "," "," "," "," "," "," "," "," "," "," "," "," "," "," "," "]
[null,null,"P11111111113432",1,"TO",10,"STAGE1",11," "," ","STAGE3",12," "," ","MONIT",13," "," ","STAGE3",14," "," ","STAGE2"," "," "," "," "," "," "," "," "," "," "," "," "," "," "," "," "," "," "," "," "," "," "," "," "," "," "," "," "," "," "," "," "," "," "," "," "]
[null,null,"P11111111113433",1,"TO",10,"STAGE1",11," "," ","STAGE3",12," "," ","MONIT",13,"AND",14,"STAGE3"," "," "," "," "," "," "," "," "," "," "," "," "," "," "," "," "," "," "," "," "," "," "," "," "," "," "," "," "," "," "," "," "," "," "," "," "," "," "," "," "]
[null,null,"P11111111113434",1,"TO",10,"STAGE1",11," "," ","STAGE3",12," "," ","MONIT",13," "," ","STAGE3",14," "," ","MONIT"," "," "," "," "," "," "," "," "," "," "," "," "," "," "," "," "," "," "," "," "," "," "," "," "," "," "," "," "," "," "," "," "," "," "," "," "]
[null,null,"P11111111113440",1,"TO",10,"STAGE1",11," "," ","STAGE3",12,"AND",13,"MONIT",14," "," ","ISOL"," "," "," "," "," "," "," "," "," "," "," "," "," "," "," "," "," "," "," "," "," "," "," "," "," "," "," "," "," "," "," "," "," "," "," "," "," "," "," "," "]
[null,null,"P11111111113441",1,"TO",10,"STAGE1",11," "," ","STAGE3",12,"AND",13,"MONIT",14," "," ","STAGE1"," "," "," "," "," "," "," "," "," "," "," "," "," "," "," "," "," "," "," "," "," "," "," "," "," "," "," "," "," "," "," "," "," "," "," "," "," "," "," "," "]
[null,null,"P11111111113442",1,"TO",10,"STAGE1",11," "," ","STAGE3",12,"AND",13,"MONIT",14," "," ","STAGE2"," "," "," "," "," "," "," "," "," "," "," "," "," "," "," "," "," "," "," "," "," "," "," "," "," "," "," "," "," "," "," "," "," "," "," "," "," "," "," "," "]
[null,null,"P11111111113443",1,"TO",10,"STAGE1",11," "," ","STAGE3",12,"AND",13,"MONIT",14," "," ","STAGE3"," "," "," "," "," "," "," "," "," "," "," "," "," "," "," "," "," "," "," "," "," "," "," "," "," "," "," "," "," "," "," "," "," "," "," "," "," "," "," "," "]
[null,null,"P11111111113444",1,"TO",10,"STAGE1",11," "," ","STAGE3",12,"TO",14,"MONIT"," "," "," "," "," "," "," "," "," "," "," "," "," "," "," "," "," "," "," "," "," "," "," "," "," "," "," "," "," "," "," "," "," "," "," "," "," "," "," "," "," "," "," "," "]
[null,null,"P11111111113489",1,"TO",10,"STAGE1",11," "," ","STAGE3",12," "," ","MONIT",13,"AND",14,"SHORT"," "," "," "," "," "," "," "," "," "," "," "," "," "," "," "," "," "," "," "," "," "," "," "," "," "," "," "," "," "," "," "," "," "," "," "," "," "," "," "," "]
[null,null,"P11111111114000",1,"TO",10,"STAGE1",11," "," ","MONIT",12,"TO",14,"ISOL"," "," "," "," "," "," "," "," "," "," "," "," "," "," "," "," "," "," "," "," "," "," "," "," "," "," "," "," "," "," "," "," "," "," "," "," "," "," "," "," "," "," "," "," "]
[null,null,"P11111111114001",1,"TO",10,"STAGE1",11," "," ","MONIT",12,"AND",13,"ISOL",14," "," ","STAGE1"," "," "," "," "," "," "," "," "," "," "," "," "," "," "," "," "," "," "," "," "," "," "," "," "," "," "," "," "," "," "," "," "," "," "," "," "," "," "," "," "]
[null,null,"P11111111114002",1,"TO",10,"STAGE1",11," "," ","MONIT",12,"AND",13,"ISOL",14," "," ","STAGE2"," "," "," "," "," "," "," "," "," "," "," "," "," "," "," "," "," "," "," "," "," "," "," "," "," "," "," "," "," "," "," "," "," "," "," "," "," "," "," "," "]
[null,null,"P11111111114003",1,"TO",10,"STAGE1",11," "," ","MONIT",12,"AND",13,"ISOL",14," "," ","STAGE3"," "," "," "," "," "," "," "," "," "," "," "," "," "," "," "," "," "," "," "," "," "," "," "," "," "," "," "," "," "," "," "," "," "," "," "," "," "," "," "," "]
[null,null,"P11111111114004",1,"TO",10,"STAGE1",11," "," ","MONIT",12,"AND",13,"ISOL",14," "," ","MONIT"," "," "," "," "," "," "," "," "," "," "," "," "," "," "," "," "," "," "," "," "," "," "," "," "," "," "," "," "," "," "," "," "," "," "," "," "," "," "," "," "]
[null,null,"P11111111114010",1,"TO",10,"STAGE1",11," "," ","MONIT",12," "," ","ISOL",13," "," ","STAGE1",14," "," ","MONIT"," "," "," "," "," "," "," "," "," "," "," "," "," "," "," "," "," "," "," "," "," "," "," "," "," "," "," "," "," "," "," "," "," "," "," "," "]
[null,null,"P11111111114011",1,"TO",10,"STAGE1",11," "," ","MONIT",12," "," ","ISOL",13,"AND",14,"STAGE1"," "," "," "," "," "," "," "," "," "," "," "," "," "," "," "," "," "," "," "," "," "," "," "," "," "," "," "," "," "," "," "," "," "," "," "," "," "," "," "," "]
[null,null,"P11111111114012",1,"TO",10,"STAGE1",11," "," ","MONIT",12," "," ","ISOL",13," "," ","STAGE1",14," "," ","STAGE2"," "," "," "," "," "," "," "," "," "," "," "," "," "," "," "," "," "," "," "," "," "," "," "," "," "," "," "," "," "," "," "," "," "," "," "," "]
[null,null,"P11111111114013",1,"TO",10,"STAGE1",11," "," ","MONIT",12," "," ","ISOL",13," "," ","STAGE1",14," "," ","STAGE3"," "," "," "," "," "," "," "," "," "," "," "," "," "," "," "," "," "," "," "," "," "," "," "," "," "," "," "," "," "," "," "," "," "," "," "," "]
[null,null,"P11111111114014",1,"TO",10,"STAGE1",11," "," ","MONIT",12," "," ","ISOL",13," "," ","STAGE1",14," "," ","MONIT"," "," "," "," "," "," "," "," "," "," "," "," "," "," "," "," "," "," "," "," "," "," "," "," "," "," "," "," "," "," "," "," "," "," "," "," "]
[null,null,"P11111111114020",1,"TO",10,"STAGE1",11," "," ","MONIT",12," "," ","ISOL",13," "," ","STAGE2",14," "," ","MONIT"," "," "," "," "," "," "," "," "," "," "," "," "," "," "," "," "," "," "," "," "," "," "," "," "," "," "," "," "," "," "," "," "," "," "," "," "]
[null,null,"P11111111114021",1,"TO",10,"STAGE1",11," "," ","MONIT",12," "," ","ISOL",13," "," ","STAGE2",14," "," ","STAGE1"," "," "," "," "," "," "," "," "," "," "," "," "," "," "," "," "," "," "," "," "," "," "," "," "," "," "," "," "," "," "," "," "," "," "," "," "]
[null,null,"P11111111114022",1,"TO",10,"STAGE1",11," "," ","MONIT",12," "," ","ISOL",13,"AND",14,"STAGE2"," "," "," "," "," "," "," "," "," "," "," "," "," "," "," "," "," "," "," "," "," "," "," "," "," "," "," "," "," "," "," "," "," "," "," "," "," "," "," "," "]
[null,null,"P11111111114023",1,"TO",10,"STAGE1",11," "," ","MONIT",12," "," ","ISOL",13," "," ","STAGE2",14," "," ","STAGE3"," "," "," "," "," "," "," "," "," "," "," "," "," "," "," "," "," "," "," "," "," "," "," "," "," "," "," "," "," "," "," "," "," "," "," "," "]
[null,null,"P11111111114024",1,"TO",10,"STAGE1",11," "," ","MONIT",12," "," ","ISOL",13," "," ","STAGE2",14," "," ","MONIT"," "," "," "," "," "," "," "," "," "," "," "," "," "," "," "," "," "," "," "," "," "," "," "," "," "," "," "," "," "," "," "," "," "," "," "," "]
[null,null,"P11111111114030",1,"TO",10,"STAGE1",11," "," ","MONIT",12," "," ","ISOL",13," "," ","STAGE3",14," "," ","MONIT"," "," "," "," "," "," "," "," "," "," "," "," "," "," "," "," "," "," "," "," "," "," "," "," "," "," "," "," "," "," "," "," "," "," "," "," "]
[null,null,"P11111111114031",1,"TO",10,"STAGE1",11," "," ","MONIT",12," "," ","ISOL",13," "," ","STAGE3",14," "," ","STAGE1"," "," "," "," "," "," "," "," "," "," "," "," "," "," "," "," "," "," "," "," "," "," "," "," "," "," "," "," "," "," "," "," "," "," "," "," "]
[null,null,"P11111111114032",1,"TO",10,"STAGE1",11," "," ","MONIT",12," "," ","ISOL",13," "," ","STAGE3",14," "," ","STAGE2"," "," "," "," "," "," "," "," "," "," "," "," "," "," "," "," "," "," "," "," "," "," "," "," "," "," "," "," "," "," "," "," "," "," "," "," "]
[null,null,"P11111111114033",1,"TO",10,"STAGE1",11," "," ","MONIT",12," "," ","ISOL",13,"AND",14,"STAGE3"," "," "," "," "," "," "," "," "," "," "," "," "," "," "," "," "," "," "," "," "," "," "," "," "," "," "," "," "," "," "," "," "," "," "," "," "," "," "," "," "]
[null,null,"P11111111114034",1,"TO",10,"STAGE1",11," "," ","MONIT",12," "," ","ISOL",13," "," ","STAGE3",14," "," ","MONIT"," "," "," "," "," "," "," "," "," "," "," "," "," "," "," "," "," "," "," "," "," "," "," "," "," "," "," "," "," "," "," "," "," "," "," "," "]
[null,null,"P11111111114040",1,"TO",10,"STAGE1",11," "," ","MONIT",12," "," ","ISOL",13," "," ","MONIT",14," "," ","ISOL"," "," "," "," "," "," "," "," "," "," "," "," "," "," "," "," "," "," "," "," "," "," "," "," "," "," "," "," "," "," "," "," "," "," "," "," "]
[null,null,"P11111111114041",1,"TO",10,"STAGE1",11," "," ","MONIT",12," "," ","ISOL",13," "," ","MONIT",14," "," ","STAGE1"," "," "," "," "," "," "," "," "," "," "," "," "," "," "," "," "," "," "," "," "," "," "," "," "," "," "," "," "," "," "," "," "," "," "," "," "]
[null,null,"P11111111114042",1,"TO",10,"STAGE1",11," "," ","MONIT",12," "," ","ISOL",13," "," ","MONIT",14," "," ","STAGE2"," "," "," "," "," "," "," "," "," "," "," "," "," "," "," "," "," "," "," "," "," "," "," "," "," "," "," "," "," "," "," "," "," "," "," "," "]
[null,null,"P11111111114043",1,"TO",10,"STAGE1",11," "," ","MONIT",12," "," ","ISOL",13," "," ","MONIT",14," "," ","STAGE3"," "," "," "," "," "," "," "," "," "," "," "," "," "," "," "," "," "," "," "," "," "," "," "," "," "," "," "," "," "," "," "," "," "," "," "," "]
[null,null,"P11111111114044",1,"TO",10,"STAGE1",11," "," ","MONIT",12," "," ","ISOL",13,"AND",14,"MONIT"," "," "," "," "," "," "," "," "," "," "," "," "," "," "," "," "," "," "," "," "," "," "," "," "," "," "," "," "," "," "," "," "," "," "," "," "," "," "," "," "]
[null,null,"P11111111114089",1,"TO",10,"STAGE1",11," "," ","MONIT",12," "," ","ISOL",13,"AND",14,"SHORT"," "," "," "," "," "," "," "," "," "," "," "," "," "," "," "," "," "," "," "," "," "," "," "," "," "," "," "," "," "," "," "," "," "," "," "," "," "," "," "," "]
[null,null,"P11111111114100",1,"TO",10,"STAGE1",11," "," ","MONIT",12," "," ","STAGE1",13,"AND",14,"ISOL"," "," "," "," "," "," "," "," "," "," "," "," "," "," "," "," "," "," "," "," "," "," "," "," "," "," "," "," "," "," "," "," "," "," "," "," "," "," "," "," "]
[null,null,"P11111111114101",1,"TO",10,"STAGE1",11," "," ","MONIT",12," "," ","STAGE1",13," "," ","ISOL",14," "," ","STAGE1"," "," "," "," "," "," "," "," "," "," "," "," "," "," "," "," "," "," "," "," "," "," "," "," "," "," "," "," "," "," "," "," "," "," "," "," "]
[null,null,"P11111111114102",1,"TO",10,"STAGE1",11," "," ","MONIT",12," "," ","STAGE1",13," "," ","ISOL",14," "," ","STAGE2"," "," "," "," "," "," "," "," "," "," "," "," "," "," "," "," "," "," "," "," "," "," "," "," "," "," "," "," "," "," "," "," "," "," "," "," "]
[null,null,"P11111111114103",1,"TO",10,"STAGE1",11," "," ","MONIT",12," "," ","STAGE1",13," "," ","ISOL",14," "," ","STAGE3"," "," "," "," "," "," "," "," "," "," "," "," "," "," "," "," "," "," "," "," "," "," "," "," "," "," "," "," "," "," "," "," "," "," "," "," "]
[null,null,"P11111111114104",1,"TO",10,"STAGE1",11," "," ","MONIT",12," "," ","STAGE1",13," "," ","ISOL",14," "," ","MONIT"," "," "," "," "," "," "," "," "," "," "," "," "," "," "," "," "," "," "," "," "," "," "," "," "," "," "," "," "," "," "," "," "," "," "," "," "]
[null,null,"P11111111114110",1,"TO",10,"STAGE1",11," "," ","MONIT",12,"AND",13,"STAGE1",14," "," ","ISOL"," "," "," "," "," "," "," "," "," "," "," "," "," "," "," "," "," "," "," "," "," "," "," "," "," "," "," "," "," "," "," "," "," "," "," "," "," "," "," "," "]
[null,null,"P11111111114111",1,"TO",10,"STAGE1",11," "," ","MONIT",12,"TO",14,"STAGE1"," "," "," "," "," "," "," "," "," "," "," "," "," "," "," "," "," "," "," "," "," "," "," "," "," "," "," "," "," "," "," "," "," "," "," "," "," "," "," "," "," "," "," "," "]
[null,null,"P11111111114112",1,"TO",10,"STAGE1",11," "," ","MONIT",12,"AND",13,"STAGE1",14," "," ","STAGE2"," "," "," "," "," "," "," "," "," "," "," "," "," "," "," "," "," "," "," "," "," "," "," "," "," "," "," "," "," "," "," "," "," "," "," "," "," "," "," "," "]
[null,null,"P11111111114113",1,"TO",10,"STAGE1",11," "," ","MONIT",12,"AND",13,"STAGE1",14," "," ","STAGE3"," "," "," "," "," "," "," "," "," "," "," "," "," "," "," "," "," "," "," "," "," "," "," "," "," "," "," "," "," "," "," "," "," "," "," "," "," "," "," "," "]
[null,null,"P11111111114114",1,"TO",10,"STAGE1",11," "," ","MONIT",12,"AND",13,"STAGE1",14," "," ","MONIT"," "," "," "," "," "," "," "," "," "," "," "," "," "," "," "," "," "," "," "," "," "," "," "," "," "," "," "," "," "," "," "," "," "," "," "," "," "," "," "," "]
[null,null,"P11111111114120",1,"TO",10,"STAGE1",11," "," ","MONIT",12," "," ","STAGE1",13," "," ","STAGE2",14," "," ","ISOL"," "," "," "," "," "," "," "," "," "," "," "," "," "," "," "," "," "," "," "," "," "," "," "," "," "," "," "," "," "," "," "," "," "," "," "," "]
[null,null,"P11111111114121",1,"TO",10,"STAGE1",11," "," ","MONIT",12," "," ","STAGE1",13," "," ","STAGE2",14," "," ","STAGE1"," "," "," "," "," "," "," "," "," "," "," "," "," "," "," "," "," "," "," "," "," "," "," "," "," "," "," "," "," "," "," "," "," "," "," "," "]
[null,null,"P11111111114122",1,"TO",10,"STAGE1",11," "," ","MONIT",12," "," ","STAGE1",13,"AND",14,"STAGE2"," "," "," "," "," "," "," "," "," "," "," "," "," "," "," "," "," "," "," "," "," "," "," "," "," "," "," "," "," "," "," "," "," "," "," "," "," "," "," "," "]
[null,null,"P11111111114123",1,"TO",10,"STAGE1",11," "," ","MONIT",12," "," ","STAGE1",13," "," ","STAGE2",14," "," ","STAGE3"," "," "," "," "," "," "," "," "," "," "," "," "," "," "," "," "," "," "," "," "," "," "," "," "," "," "," "," "," "," "," "," "," "," "," "," "]
[null,null,"P11111111114124",1,"TO",10,"STAGE1",11," "," ","MONIT",12," "," ","STAGE1",13," "," ","STAGE2",14," "," ","MONIT"," "," "," "," "," "," "," "," "," "," "," "," "," "," "," "," "," "," "," "," "," "," "," "," "," "," "," "," "," "," "," "," "," "," "," "," "]
[null,null,"P11111111114130",1,"TO",10,"STAGE1",11," "," ","MONIT",12," "," ","STAGE1",13," "," ","STAGE3",14," "," ","ISOL"," "," "," "," "," "," "," "," "," "," "," "," "," "," "," "," "," "," "," "," "," "," "," "," "," "," "," "," "," "," "," "," "," "," "," "," "]
[null,null,"P11111111114131",1,"TO",10,"STAGE1",11," "," ","MONIT",12," "," ","STAGE1",13," "," ","STAGE3",14," "," ","STAGE1"," "," "," "," "," "," "," "," "," "," "," "," "," "," "," "," "," "," "," "," "," "," "," "," "," "," "," "," "," "," "," "," "," "," "," "," "]
[null,null,"P11111111114132",1,"TO",10,"STAGE1",11," "," ","MONIT",12," "," ","STAGE1",13," "," ","STAGE3",14," "," ","STAGE2"," "," "," "," "," "," "," "," "," "," "," "," "," "," "," "," "," "," "," "," "," "," "," "," "," "," "," "," "," "," "," "," "," "," "," "," "]
[null,null,"P11111111114133",1,"TO",10,"STAGE1",11," "," ","MONIT",12," "," ","STAGE1",13,"AND",14,"STAGE3"," "," "," "," "," "," "," "," "," "," "," "," "," "," "," "," "," "," "," "," "," "," "," "," "," "," "," "," "," "," "," "," "," "," "," "," "," "," "," "," "]
[null,null,"P11111111114134",1,"TO",10,"STAGE1",11," "," ","MONIT",12," "," ","STAGE1",13," "," ","STAGE3",14," "," ","MONIT"," "," "," "," "," "," "," "," "," "," "," "," "," "," "," "," "," "," "," "," "," "," "," "," "," "," "," "," "," "," "," "," "," "," "," "," "]
[null,null,"P11111111114144",1,"TO",10,"STAGE1",11," "," ","MONIT",12," "," ","STAGE1",13,"AND",14,"MONIT"," "," "," "," "," "," "," "," "," "," "," "," "," "," "," "," "," "," "," "," "," "," "," "," "," "," "," "," "," "," "," "," "," "," "," "," "," "," "," "," "]
[null,null,"P11111111114189",1,"TO",10,"STAGE1",11," "," ","MONIT",12," "," ","STAGE1",13,"AND",14,"SHORT"," "," "," "," "," "," "," "," "," "," "," "," "," "," "," "," "," "," "," "," "," "," "," "," "," "," "," "," "," "," "," "," "," "," "," "," "," "," "," "," "]
[null,null,"P11111111114200",1,"TO",10,"STAGE1",11," "," ","MONIT",12," "," ","STAGE2",13,"AND",14,"ISOL"," "," "," "," "," "," "," "," "," "," "," "," "," "," "," "," "," "," "," "," "," "," "," "," "," "," "," "," "," "," "," "," "," "," "," "," "," "," "," "," "]
[null,null,"P11111111114201",1,"TO",10,"STAGE1",11," "," ","MONIT",12," "," ","STAGE2",13," "," ","ISOL",14," "," ","STAGE1"," "," "," "," "," "," "," "," "," "," "," "," "," "," "," "," "," "," "," "," "," "," "," "," "," "," "," "," "," "," "," "," "," "," "," "," "]
[null,null,"P11111111114202",1,"TO",10,"STAGE1",11," "," ","MONIT",12," "," ","STAGE2",13," "," ","ISOL",14," "," ","STAGE2"," "," "," "," "," "," "," "," "," "," "," "," "," "," "," "," "," "," "," "," "," "," "," "," "," "," "," "," "," "," "," "," "," "," "," "," "]
[null,null,"P11111111114203",1,"TO",10,"STAGE1",11," "," ","MONIT",12," "," ","STAGE2",13," "," ","ISOL",14," "," ","STAGE3"," "," "," "," "," "," "," "," "," "," "," "," "," "," "," "," "," "," "," "," "," "," "," "," "," "," "," "," "," "," "," "," "," "," "," "," "]
[null,null,"P11111111114204",1,"TO",10,"STAGE1",11," "," ","MONIT",12," "," ","STAGE2",13," "," ","ISOL",14," "," ","MONIT"," "," "," "," "," "," "," "," "," "," "," "," "," "," "," "," "," "," "," "," "," "," "," "," "," "," "," "," "," "," "," "," "," "," "," "," "]
[null,null,"P11111111114210",1,"TO",10,"STAGE1",11," "," ","MONIT",12," "," ","STAGE2",13," "," ","STAGE1",14," "," ","ISOL"," "," "," "," "," "," "," "," "," "," "," "," "," "," "," "," "," "," "," "," "," "," "," "," "," "," "," "," "," "," "," "," "," "," "," "," "]
[null,null,"P11111111114211",1,"TO",10,"STAGE1",11," "," ","MONIT",12," "," ","STAGE2",13,"AND",14,"STAGE1"," "," "," "," "," "," "," "," "," "," "," "," "," "," "," "," "," "," "," "," "," "," "," "," "," "," "," "," "," "," "," "," "," "," "," "," "," "," "," "," "]
[null,null,"P11111111114212",1,"TO",10,"STAGE1",11," "," ","MONIT",12," "," ","STAGE2",13," "," ","STAGE1",14," "," ","STAGE2"," "," "," "," "," "," "," "," "," "," "," "," "," "," "," "," "," "," "," "," "," "," "," "," "," "," "," "," "," "," "," "," "," "," "," "," "]
[null,null,"P11111111114213",1,"TO",10,"STAGE1",11," "," ","MONIT",12," "," ","STAGE2",13," "," ","STAGE1",14," "," ","STAGE3"," "," "," "," "," "," "," "," "," "," "," "," "," "," "," "," "," "," "," "," "," "," "," "," "," "," "," "," "," "," "," "," "," "," "," "," "]
[null,null,"P11111111114214",1,"TO",10,"STAGE1",11," "," ","MONIT",12," "," ","STAGE2",13," "," ","STAGE1",14," "," ","MONIT"," "," "," "," "," "," "," "," "," "," "," "," "," "," "," "," "," "," "," "," "," "," "," "," "," "," "," "," "," "," "," "," "," "," "," "," "]
[null,null,"P11111111114220",1,"TO",10,"STAGE1",11," "," ","MONIT",12,"AND",13,"STAGE2",14," "," ","ISOL"," "," "," "," "," "," "," "," "," "," "," "," "," "," "," "," "," "," "," "," "," "," "," "," "," "," "," "," "," "," "," "," "," "," "," "," "," "," "," "," "]
[null,null,"P11111111114221",1,"TO",10,"STAGE1",11," "," ","MONIT",12,"AND",13,"STAGE2",14," "," ","STAGE1"," "," "," "," "," "," "," "," "," "," "," "," "," "," "," "," "," "," "," "," "," "," "," "," "," "," "," "," "," "," "," "," "," "," "," "," "," "," "," "," "]
[null,null,"P11111111114222",1,"TO",10,"STAGE1",11," "," ","MONIT",12,"TO",14,"STAGE2"," "," "," "," "," "," "," "," "," "," "," "," "," "," "," "," "," "," "," "," "," "," "," "," "," "," "," "," "," "," "," "," "," "," "," "," "," "," "," "," "," "," "," "," "]
[null,null,"P11111111114223",1,"TO",10,"STAGE1",11," "," ","MONIT",12,"AND",13,"STAGE2",14," "," ","STAGE3"," "," "," "," "," "," "," "," "," "," "," "," "," "," "," "," "," "," "," "," "," "," "," "," "," "," "," "," "," "," "," "," "," "," "," "," "," "," "," "," "]
[null,null,"P11111111114224",1,"TO",10,"STAGE1",11," "," ","MONIT",12,"AND",13,"STAGE2",14," "," ","MONIT"," "," "," "," "," "," "," "," "," "," "," "," "," "," "," "," "," "," "," "," "," "," "," "," "," "," "," "," "," "," "," "," "," "," "," "," "," "," "," "," "]
[null,null,"P11111111114230",1,"TO",10,"STAGE1",11," "," ","MONIT",12," "," ","STAGE2",13," "," ","STAGE3",14," "," ","ISOL"," "," "," "," "," "," "," "," "," "," "," "," "," "," "," "," "," "," "," "," "," "," "," "," "," "," "," "," "," "," "," "," "," "," "," "," "]
[null,null,"P11111111114231",1,"TO",10,"STAGE1",11," "," ","MONIT",12," "," ","STAGE2",13," "," ","STAGE3",14," "," ","STAGE1"," "," "," "," "," "," "," "," "," "," "," "," "," "," "," "," "," "," "," "," "," "," "," "," "," "," "," "," "," "," "," "," "," "," "," "," "]
[null,null,"P11111111114232",1,"TO",10,"STAGE1",11," "," ","MONIT",12," "," ","STAGE2",13," "," ","STAGE3",14," "," ","STAGE2"," "," "," "," "," "," "," "," "," "," "," "," "," "," "," "," "," "," "," "," "," "," "," "," "," "," "," "," "," "," "," "," "," "," "," "," "]
[null,null,"P11111111114233",1,"TO",10,"STAGE1",11," "," ","MONIT",12," "," ","STAGE2",13,"AND",14,"STAGE3"," "," "," "," "," "," "," "," "," "," "," "," "," "," "," "," "," "," "," "," "," "," "," "," "," "," "," "," "," "," "," "," "," "," "," "," "," "," "," "," "]
[null,null,"P11111111114234",1,"TO",10,"STAGE1",11," "," ","MONIT",12," "," ","STAGE2",13," "," ","STAGE3",14," "," ","MONIT"," "," "," "," "," "," "," "," "," "," "," "," "," "," "," "," "," "," "," "," "," "," "," "," "," "," "," "," "," "," "," "," "," "," "," "," "]
[null,null,"P11111111114240",1,"TO",10,"STAGE1",11," "," ","MONIT",12," "," ","STAGE2",13," "," ","MONIT",14," "," ","ISOL"," "," "," "," "," "," "," "," "," "," "," "," "," "," "," "," "," "," "," "," "," "," "," "," "," "," "," "," "," "," "," "," "," "," "," "," "]
[null,null,"P11111111114241",1,"TO",10,"STAGE1",11," "," ","MONIT",12," "," ","STAGE2",13," "," ","MONIT",14," "," ","STAGE1"," "," "," "," "," "," "," "," "," "," "," "," "," "," "," "," "," "," "," "," "," "," "," "," "," "," "," "," "," "," "," "," "," "," "," "," "]
[null,null,"P11111111114242",1,"TO",10,"STAGE1",11," "," ","MONIT",12," "," ","STAGE2",13," "," ","MONIT",14," "," ","STAGE2"," "," "," "," "," "," "," "," "," "," "," "," "," "," "," "," "," "," "," "," "," "," "," "," "," "," "," "," "," "," "," "," "," "," "," "," "]
[null,null,"P11111111114243",1,"TO",10,"STAGE1",11," "," ","MONIT",12," "," ","STAGE2",13," "," ","MONIT",14," "," ","STAGE3"," "," "," "," "," "," "," "," "," "," "," "," "," "," "," "," "," "," "," "," "," "," "," "," "," "," "," "," "," "," "," "," "," "," "," "," "]
[null,null,"P11111111114244",1,"TO",10,"STAGE1",11," "," ","MONIT",12," "," ","STAGE2",13,"AND",14,"MONIT"," "," "," "," "," "," "," "," "," "," "," "," "," "," "," "," "," "," "," "," "," "," "," "," "," "," "," "," "," "," "," "," "," "," "," "," "," "," "," "," "]
[null,null,"P11111111114289",1,"TO",10,"STAGE1",11," "," ","MONIT",12," "," ","STAGE2",13,"AND",14,"SHORT"," "," "," "," "," "," "," "," "," "," "," "," "," "," "," "," "," "," "," "," "," "," "," "," "," "," "," "," "," "," "," "," "," "," "," "," "," "," "," "," "]
[null,null,"P11111111114300",1,"TO",10,"STAGE1",11," "," ","MONIT",12," "," ","STAGE3",13,"AND",14,"ISOL"," "," "," "," "," "," "," "," "," "," "," "," "," "," "," "," "," "," "," "," "," "," "," "," "," "," "," "," "," "," "," "," "," "," "," "," "," "," "," "," "]
[null,null,"P11111111114301",1,"TO",10,"STAGE1",11," "," ","MONIT",12," "," ","STAGE3",13," "," ","ISOL",14," "," ","STAGE1"," "," "," "," "," "," "," "," "," "," "," "," "," "," "," "," "," "," "," "," "," "," "," "," "," "," "," "," "," "," "," "," "," "," "," "," "]
[null,null,"P11111111114302",1,"TO",10,"STAGE1",11," "," ","MONIT",12," "," ","STAGE3",13," "," ","ISOL",14," "," ","STAGE2"," "," "," "," "," "," "," "," "," "," "," "," "," "," "," "," "," "," "," "," "," "," "," "," "," "," "," "," "," "," "," "," "," "," "," "," "]
[null,null,"P11111111114303",1,"TO",10,"STAGE1",11," "," ","MONIT",12," "," ","STAGE3",13," "," ","ISOL",14," "," ","STAGE3"," "," "," "," "," "," "," "," "," "," "," "," "," "," "," "," "," "," "," "," "," "," "," "," "," "," "," "," "," "," "," "," "," "," "," "," "]
[null,null,"P11111111114304",1,"TO",10,"STAGE1",11," "," ","MONIT",12," "," ","STAGE3",13," "," ","ISOL",14," "," ","MONIT"," "," "," "," "," "," "," "," "," "," "," "," "," "," "," "," "," "," "," "," "," "," "," "," "," "," "," "," "," "," "," "," "," "," "," "," "]
[null,null,"P11111111114310",1,"TO",10,"STAGE1",11," "," ","MONIT",12," "," ","STAGE3",13," "," ","STAGE1",14," "," ","ISOL"," "," "," "," "," "," "," "," "," "," "," "," "," "," "," "," "," "," "," "," "," "," "," "," "," "," "," "," "," "," "," "," "," "," "," "," "]
[null,null,"P11111111114311",1,"TO",10,"STAGE1",11," "," ","MONIT",12," "," ","STAGE3",13,"AND",14,"STAGE1"," "," "," "," "," "," "," "," "," "," "," "," "," "," "," "," "," "," "," "," "," "," "," "," "," "," "," "," "," "," "," "," "," "," "," "," "," "," "," "," "]
[null,null,"P11111111114312",1,"TO",10,"STAGE1",11," "," ","MONIT",12," "," ","STAGE3",13," "," ","STAGE1",14," "," ","STAGE2"," "," "," "," "," "," "," "," "," "," "," "," "," "," "," "," "," "," "," "," "," "," "," "," "," "," "," "," "," "," "," "," "," "," "," "," "]
[null,null,"P11111111114313",1,"TO",10,"STAGE1",11," "," ","MONIT",12," "," ","STAGE3",13," "," ","STAGE1",14," "," ","STAGE3"," "," "," "," "," "," "," "," "," "," "," "," "," "," "," "," "," "," "," "," "," "," "," "," "," "," "," "," "," "," "," "," "," "," "," "," "]
[null,null,"P11111111114314",1,"TO",10,"STAGE1",11," "," ","MONIT",12," "," ","STAGE3",13," "," ","STAGE1",14," "," ","MONIT"," "," "," "," "," "," "," "," "," "," "," "," "," "," "," "," "," "," "," "," "," "," "," "," "," "," "," "," "," "," "," "," "," "," "," "," "]
[null,null,"P11111111114320",1,"TO",10,"STAGE1",11," "," ","MONIT",12," "," ","STAGE3",13," "," ","STAGE2",14," "," ","ISOL"," "," "," "," "," "," "," "," "," "," "," "," "," "," "," "," "," "," "," "," "," "," "," "," "," "," "," "," "," "," "," "," "," "," "," "," "]
[null,null,"P11111111114321",1,"TO",10,"STAGE1",11," "," ","MONIT",12," "," ","STAGE3",13," "," ","STAGE2",14," "," ","STAGE1"," "," "," "," "," "," "," "," "," "," "," "," "," "," "," "," "," "," "," "," "," "," "," "," "," "," "," "," "," "," "," "," "," "," "," "," "]
[null,null,"P11111111114322",1,"TO",10,"STAGE1",11," "," ","MONIT",12," "," ","STAGE3",13,"AND",14,"STAGE2"," "," "," "," "," "," "," "," "," "," "," "," "," "," "," "," "," "," "," "," "," "," "," "," "," "," "," "," "," "," "," "," "," "," "," "," "," "," "," "," "]
[null,null,"P11111111114323",1,"TO",10,"STAGE1",11," "," ","MONIT",12," "," ","STAGE3",13," "," ","STAGE2",14," "," ","STAGE3"," "," "," "," "," "," "," "," "," "," "," "," "," "," "," "," "," "," "," "," "," "," "," "," "," "," "," "," "," "," "," "," "," "," "," "," "]
[null,null,"P11111111114324",1,"TO",10,"STAGE1",11," "," ","MONIT",12," "," ","STAGE3",13," "," ","STAGE2",14," "," ","MONIT"," "," "," "," "," "," "," "," "," "," "," "," "," "," "," "," "," "," "," "," "," "," "," "," "," "," "," "," "," "," "," "," "," "," "," "," "]
[null,null,"P11111111114330",1,"TO",10,"STAGE1",11," "," ","MONIT",12,"AND",13,"STAGE3",14," "," ","ISOL"," "," "," "," "," "," "," "," "," "," "," "," "," "," "," "," "," "," "," "," "," "," "," "," "," "," "," "," "," "," "," "," "," "," "," "," "," "," "," "," "]
[null,null,"P11111111114331",1,"TO",10,"STAGE1",11," "," ","MONIT",12,"AND",13,"STAGE3",14," "," ","STAGE1"," "," "," "," "," "," "," "," "," "," "," "," "," "," "," "," "," "," "," "," "," "," "," "," "," "," "," "," "," "," "," "," "," "," "," "," "," "," "," "," "]
[null,null,"P11111111114332",1,"TO",10,"STAGE1",11," "," ","MONIT",12,"AND",13,"STAGE3",14," "," ","STAGE2"," "," "," "," "," "," "," "," "," "," "," "," "," "," "," "," "," "," "," "," "," "," "," "," "," "," "," "," "," "," "," "," "," "," "," "," "," "," "," "," "]
[null,null,"P11111111114333",1,"TO",10,"STAGE1",11," "," ","MONIT",12,"TO",14,"STAGE3"," "," "," "," "," "," "," "," "," "," "," "," "," "," "," "," "," "," "," "," "," "," "," "," "," "," "," "," "," "," "," "," "," "," "," "," "," "," "," "," "," "," "," "," "]
[null,null,"P11111111114334",1,"TO",10,"STAGE1",11," "," ","MONIT",12,"AND",13,"STAGE3",14," "," ","MONIT"," "," "," "," "," "," "," "," "," "," "," "," "," "," "," "," "," "," "," "," "," "," "," "," "," "," "," "," "," "," "," "," "," "," "," "," "," "," "," "," "]
[null,null,"P11111111114340",1,"TO",10,"STAGE1",11," "," ","MONIT",12," "," ","STAGE3",13," "," ","MONIT",14," "," ","ISOL"," "," "," "," "," "," "," "," "," "," "," "," "," "," "," "," "," "," "," "," "," "," "," "," "," "," "," "," "," "," "," "," "," "," "," "," "]
[null,null,"P11111111114341",1,"TO",10,"STAGE1",11," "," ","MONIT",12," "," ","STAGE3",13," "," ","MONIT",14," "," ","STAGE1"," "," "," "," "," "," "," "," "," "," "," "," "," "," "," "," "," "," "," "," "," "," "," "," "," "," "," "," "," "," "," "," "," "," "," "," "]
[null,null,"P11111111114342",1,"TO",10,"STAGE1",11," "," ","MONIT",12," "," ","STAGE3",13," "," ","MONIT",14," "," ","STAGE2"," "," "," "," "," "," "," "," "," "," "," "," "," "," "," "," "," "," "," "," "," "," "," "," "," "," "," "," "," "," "," "," "," "," "," "," "]
[null,null,"P11111111114343",1,"TO",10,"STAGE1",11," "," ","MONIT",12," "," ","STAGE3",13," "," ","MONIT",14," "," ","STAGE3"," "," "," "," "," "," "," "," "," "," "," "," "," "," "," "," "," "," "," "," "," "," "," "," "," "," "," "," "," "," "," "," "," "," "," "," "]
[null,null,"P11111111114344",1,"TO",10,"STAGE1",11," "," ","MONIT",12," "," ","STAGE3",13,"AND",14,"MONIT"," "," "," "," "," "," "," "," "," "," "," "," "," "," "," "," "," "," "," "," "," "," "," "," "," "," "," "," "," "," "," "," "," "," "," "," "," "," "," "," "]
[null,null,"P11111111114389",1,"TO",10,"STAGE1",11," "," ","MONIT",12," "," ","STAGE3",13,"AND",14,"SHORT"," "," "," "," "," "," "," "," "," "," "," "," "," "," "," "," "," "," "," "," "," "," "," "," "," "," "," "," "," "," "," "," "," "," "," "," "," "," "," "," "]
[null,null,"P11111111114400",1,"TO",10,"STAGE1",11,"AND",12,"MONIT",13,"AND",14,"ISOL"," "," "," "," "," "," "," "," "," "," "," "," "," "," "," "," "," "," "," "," "," "," "," "," "," "," "," "," "," "," "," "," "," "," "," "," "," "," "," "," "," "," "," "," "]
[null,null,"P11111111114401",1,"TO",10,"STAGE1",11,"AND",12,"MONIT",13," "," ","ISOL",14," "," ","STAGE1"," "," "," "," "," "," "," "," "," "," "," "," "," "," "," "," "," "," "," "," "," "," "," "," "," "," "," "," "," "," "," "," "," "," "," "," "," "," "," "," "]
[null,null,"P11111111114402",1,"TO",10,"STAGE1",11,"AND",12,"MONIT",13," "," ","ISOL",14," "," ","STAGE2"," "," "," "," "," "," "," "," "," "," "," "," "," "," "," "," "," "," "," "," "," "," "," "," "," "," "," "," "," "," "," "," "," "," "," "," "," "," "," "," "]
[null,null,"P11111111114403",1,"TO",10,"STAGE1",11,"AND",12,"MONIT",13," "," ","ISOL",14," "," ","STAGE3"," "," "," "," "," "," "," "," "," "," "," "," "," "," "," "," "," "," "," "," "," "," "," "," "," "," "," "," "," "," "," "," "," "," "," "," "," "," "," "," "]
[null,null,"P11111111114404",1,"TO",10,"STAGE1",11,"AND",12,"MONIT",13," "," ","ISOL",14," "," ","MONIT"," "," "," "," "," "," "," "," "," "," "," "," "," "," "," "," "," "," "," "," "," "," "," "," "," "," "," "," "," "," "," "," "," "," "," "," "," "," "," "," "]
[null,null,"P11111111114489",1,"TO",10,"STAGE1",11,"AND",12,"MONIT",13,"AND",14,"SHORT"," "," "," "," "," "," "," "," "," "," "," "," "," "," "," "," "," "," "," "," "," "," "," "," "," "," "," "," "," "," "," "," "," "," "," "," "," "," "," "," "," "," "," "," "]
[null,null,"P11111111118889",1,"TO",10,"STAGE1",11,"TO",14,"SHORT"," "," "," "," "," "," "," "," "," "," "," "," "," "," "," "," "," "," "," "," "," "," "," "," "," "," "," "," "," "," "," "," "," "," "," "," "," "," "," "," "," "," "," "," "," "," "," "," "]
[null,null,"P11111111118900",1,"TO",10,"STAGE1",11,"AND",12,"SHORT",13,"AND",14,"ISOL"," "," "," "," "," "," "," "," "," "," "," "," "," "," "," "," "," "," "," "," "," "," "," "," "," "," "," "," "," "," "," "," "," "," "," "," "," "," "," "," "," "," "," "," "]
[null,null,"P11111111118901",1,"TO",10,"STAGE1",11,"AND",12,"SHORT",13," "," ","ISOL",14," "," ","STAGE1"," "," "," "," "," "," "," "," "," "," "," "," "," "," "," "," "," "," "," "," "," "," "," "," "," "," "," "," "," "," "," "," "," "," "," "," "," "," "," "," "]
[null,null,"P11111111118902",1,"TO",10,"STAGE1",11,"AND",12,"SHORT",13," "," ","ISOL",14," "," ","STAGE2"," "," "," "," "," "," "," "," "," "," "," "," "," "," "," "," "," "," "," "," "," "," "," "," "," "," "," "," "," "," "," "," "," "," "," "," "," "," "," "," "]
[null,null,"P11111111118903",1,"TO",10,"STAGE1",11,"AND",12,"SHORT",13," "," ","ISOL",14," "," ","STAGE3"," "," "," "," "," "," "," "," "," "," "," "," "," "," "," "," "," "," "," "," "," "," "," "," "," "," "," "," "," "," "," "," "," "," "," "," "," "," "," "," "]
[null,null,"P11111111118904",1,"TO",10,"STAGE1",11,"AND",12,"SHORT",13," "," ","ISOL",14," "," ","MONIT"," "," "," "," "," "," "," "," "," "," "," "," "," "," "," "," "," "," "," "," "," "," "," "," "," "," "," "," "," "," "," "," "," "," "," "," "," "," "," "," "]
[null,null,"P11111111118910",1,"TO",10,"STAGE1",11,"AND",12,"SHORT",13," "," ","STAGE1",14," "," ","ISOL"," "," "," "," "," "," "," "," "," "," "," "," "," "," "," "," "," "," "," "," "," "," "," "," "," "," "," "," "," "," "," "," "," "," "," "," "," "," "," "," "]
[null,null,"P11111111118911",1,"TO",10,"STAGE1",11,"AND",12,"SHORT",13,"AND",14,"STAGE1"," "," "," "," "," "," "," "," "," "," "," "," "," "," "," "," "," "," "," "," "," "," "," "," "," "," "," "," "," "," "," "," "," "," "," "," "," "," "," "," "," "," "," "," "]
[null,null,"P11111111118912",1,"TO",10,"STAGE1",11,"AND",12,"SHORT",13," "," ","STAGE1",14," "," ","STAGE2"," "," "," "," "," "," "," "," "," "," "," "," "," "," "," "," "," "," "," "," "," "," "," "," "," "," "," "," "," "," "," "," "," "," "," "," "," "," "," "," "]
[null,null,"P11111111118913",1,"TO",10,"STAGE1",11,"AND",12,"SHORT",13," "," ","STAGE1",14," "," ","STAGE3"," "," "," "," "," "," "," "," "," "," "," "," "," "," "," "," "," "," "," "," "," "," "," "," "," "," "," "," "," "," "," "," "," "," "," "," "," "," "," "," "]
[null,null,"P11111111118914",1,"TO",10,"STAGE1",11,"AND",12,"SHORT",13," "," ","STAGE1",14," "," ","MONIT"," "," "," "," "," "," "," "," "," "," "," "," "," "," "," "," "," "," "," "," "," "," "," "," "," "," "," "," "," "," "," "," "," "," "," "," "," "," "," "," "]
[null,null,"P11111111118920",1,"TO",10,"STAGE1",11,"AND",12,"SHORT",13," "," ","STAGE2",14," "," ","ISOL"," "," "," "," "," "," "," "," "," "," "," "," "," "," "," "," "," "," "," "," "," "," "," "," "," "," "," "," "," "," "," "," "," "," "," "," "," "," "," "," "]
[null,null,"P11111111118921",1,"TO",10,"STAGE1",11,"AND",12,"SHORT",13," "," ","STAGE2",14," "," ","STAGE1"," "," "," "," "," "," "," "," "," "," "," "," "," "," "," "," "," "," "," "," "," "," "," "," "," "," "," "," "," "," "," "," "," "," "," "," "," "," "," "," "]
[null,null,"P11111111118922",1,"TO",10,"STAGE1",11,"AND",12,"SHORT",13,"AND",14,"STAGE2"," "," "," "," "," "," "," "," "," "," "," "," "," "," "," "," "," "," "," "," "," "," "," "," "," "," "," "," "," "," "," "," "," "," "," "," "," "," "," "," "," "," "," "," "]
[null,null,"P11111111118923",1,"TO",10,"STAGE1",11,"AND",12,"SHORT",13," "," ","STAGE2",14," "," ","STAGE3"," "," "," "," "," "," "," "," "," "," "," "," "," "," "," "," "," "," "," "," "," "," "," "," "," "," "," "," "," "," "," "," "," "," "," "," "," "," "," "," "]
[null,null,"P11111111118924",1,"TO",10,"STAGE1",11,"AND",12,"SHORT",13," "," ","STAGE2",14," "," ","MONIT"," "," "," "," "," "," "," "," "," "," "," "," "," "," "," "," "," "," "," "," "," "," "," "," "," "," "," "," "," "," "," "," "," "," "," "," "," "," "," "," "]
[null,null,"P11111111118930",1,"TO",10,"STAGE1",11,"AND",12,"SHORT",13," "," ","STAGE3",14," "," ","ISOL"," "," "," "," "," "," "," "," "," "," "," "," "," "," "," "," "," "," "," "," "," "," "," "," "," "," "," "," "," "," "," "," "," "," "," "," "," "," "," "," "]
[null,null,"P11111111118931",1,"TO",10,"STAGE1",11,"AND",12,"SHORT",13," "," ","STAGE3",14," "," ","STAGE1"," "," "," "," "," "," "," "," "," "," "," "," "," "," "," "," "," "," "," "," "," "," "," "," "," "," "," "," "," "," "," "," "," "," "," "," "," "," "," "," "]
[null,null,"P11111111118932",1,"TO",10,"STAGE1",11,"AND",12,"SHORT",13," "," ","STAGE3",14," "," ","STAGE2"," "," "," "," "," "," "," "," "," "," "," "," "," "," "," "," "," "," "," "," "," "," "," "," "," "," "," "," "," "," "," "," "," "," "," "," "," "," "," "," "]
[null,null,"P11111111118933",1,"TO",10,"STAGE1",11,"AND",12,"SHORT",13,"AND",14,"STAGE3"," "," "," "," "," "," "," "," "," "," "," "," "," "," "," "," "," "," "," "," "," "," "," "," "," "," "," "," "," "," "," "," "," "," "," "," "," "," "," "," "," "," "," "," "]
[null,null,"P11111111118934",1,"TO",10,"STAGE1",11,"AND",12,"SHORT",13," "," ","STAGE3",14," "," ","MONIT"," "," "," "," "," "," "," "," "," "," "," "," "," "," "," "," "," "," "," "," "," "," "," "," "," "," "," "," "," "," "," "," "," "," "," "," "," "," "," "," "]
[null,null,"P11111111118940",1,"TO",10,"STAGE1",11,"AND",12,"SHORT",13," "," ","MONIT",14," "," ","ISOL"," "," "," "," "," "," "," "," "," "," "," "," "," "," "," "," "," "," "," "," "," "," "," "," "," "," "," "," "," "," "," "," "," "," "," "," "," "," "," "," "]
[null,null,"P11111111118941",1,"TO",10,"STAGE1",11,"AND",12,"SHORT",13," "," ","MONIT",14," "," ","STAGE1"," "," "," "," "," "," "," "," "," "," "," "," "," "," "," "," "," "," "," "," "," "," "," "," "," "," "," "," "," "," "," "," "," "," "," "," "," "," "," "," "]
[null,null,"P11111111118942",1,"TO",10,"STAGE1",11,"AND",12,"SHORT",13," "," ","MONIT",14," "," ","STAGE2"," "," "," "," "," "," "," "," "," "," "," "," "," "," "," "," "," "," "," "," "," "," "," "," "," "," "," "," "," "," "," "," "," "," "," "," "," "," "," "," "]
[null,null,"P11111111118943",1,"TO",10,"STAGE1",11,"AND",12,"SHORT",13," "," ","MONIT",14," "," ","STAGE3"," "," "," "," "," "," "," "," "," "," "," "," "," "," "," "," "," "," "," "," "," "," "," "," "," "," "," "," "," "," "," "," "," "," "," "," "," "," "," "," "]
[null,null,"P11111111118944",1,"TO",10,"STAGE1",11,"AND",12,"SHORT",13,"AND",14,"MONIT"," "," "," "," "," "," "," "," "," "," "," "," "," "," "," "," "," "," "," "," "," "," "," "," "," "," "," "," "," "," "," "," "," "," "," "," "," "," "," "," "," "," "," "," "]
[null,null,"P11111111120000",1,"TO",9,"STAGE1",10,"TO",14,"ISOL"," "," "," "," "," "," "," "," "," "," "," "," "," "," "," "," "," "," "," "," "," "," "," "," "," "," "," "," "," "," "," "," "," "," "," "," "," "," "," "," "," "," "," "," "," "," "," "," "]
[null,null,"P11111111120001",1,"TO",9,"STAGE1",10,"TO",13,"ISOL",14," "," ","STAGE1"," "," "," "," "," "," "," "," "," "," "," "," "," "," "," "," "," "," "," "," "," "," "," "," "," "," "," "," "," "," "," "," "," "," "," "," "," "," "," "," "," "," "," "," "]
[null,null,"P11111111120002",1,"TO",9,"STAGE1",10,"TO",13,"ISOL",14," "," ","STAGE2"," "," "," "," "," "," "," "," "," "," "," "," "," "," "," "," "," "," "," "," "," "," "," "," "," "," "," "," "," "," "," "," "," "," "," "," "," "," "," "," "," "," "," "," "]
[null,null,"P11111111120003",1,"TO",9,"STAGE1",10,"TO",13,"ISOL",14," "," ","STAGE3"," "," "," "," "," "," "," "," "," "," "," "," "," "," "," "," "," "," "," "," "," "," "," "," "," "," "," "," "," "," "," "," "," "," "," "," "," "," "," "," "," "," "," "," "]
[null,null,"P11111111120004",1,"TO",9,"STAGE1",10,"TO",13,"ISOL",14," "," ","MONIT"," "," "," "," "," "," "," "," "," "," "," "," "," "," "," "," "," "," "," "," "," "," "," "," "," "," "," "," "," "," "," "," "," "," "," "," "," "," "," "," "," "," "," "," "]
[null,null,"P11111111120010",1,"TO",9,"STAGE1",10," "," ","STAGE2",11,"AND",12,"ISOL",13," "," ","STAGE1",14," "," ","ISOL"," "," "," "," "," "," "," "," "," "," "," "," "," "," "," "," "," "," "," "," "," "," "," "," "," "," "," "," "," "," "," "," "," "," "," "," "]
[null,null,"P11111111120011",1,"TO",9,"STAGE1",10," "," ","STAGE2",11,"AND",12,"ISOL",13,"AND",14,"STAGE1"," "," "," "," "," "," "," "," "," "," "," "," "," "," "," "," "," "," "," "," "," "," "," "," "," "," "," "," "," "," "," "," "," "," "," "," "," "," "," "," "]
[null,null,"P11111111120012",1,"TO",9,"STAGE1",10," "," ","STAGE2",11,"AND",12,"ISOL",13," "," ","STAGE1",14," "," ","STAGE2"," "," "," "," "," "," "," "," "," "," "," "," "," "," "," "," "," "," "," "," "," "," "," "," "," "," "," "," "," "," "," "," "," "," "," "," "]
[null,null,"P11111111120013",1,"TO",9,"STAGE1",10," "," ","STAGE2",11,"AND",12,"ISOL",13," "," ","STAGE1",14," "," ","STAGE3"," "," "," "," "," "," "," "," "," "," "," "," "," "," "," "," "," "," "," "," "," "," "," "," "," "," "," "," "," "," "," "," "," "," "," "," "]
[null,null,"P11111111120014",1,"TO",9,"STAGE1",10," "," ","STAGE2",11,"AND",12,"ISOL",13," "," ","STAGE1",14," "," ","MONIT"," "," "," "," "," "," "," "," "," "," "," "," "," "," "," "," "," "," "," "," "," "," "," "," "," "," "," "," "," "," "," "," "," "," "," "," "]
[null,null,"P11111111120020",1,"TO",9,"STAGE1",10," "," ","STAGE2",11,"AND",12,"ISOL",13," "," ","STAGE2",14," "," ","ISOL"," "," "," "," "," "," "," "," "," "," "," "," "," "," "," "," "," "," "," "," "," "," "," "," "," "," "," "," "," "," "," "," "," "," "," "," "]
[null,null,"P11111111120021",1,"TO",9,"STAGE1",10," "," ","STAGE2",11,"AND",12,"ISOL",13," "," ","STAGE2",14," "," ","STAGE1"," "," "," "," "," "," "," "," "," "," "," "," "," "," "," "," "," "," "," "," "," "," "," "," "," "," "," "," "," "," "," "," "," "," "," "," "]
[null,null,"P11111111120022",1,"TO",9,"STAGE1",10," "," ","STAGE2",11,"AND",12,"ISOL",13,"AND",14,"STAGE2"," "," "," "," "," "," "," "," "," "," "," "," "," "," "," "," "," "," "," "," "," "," "," "," "," "," "," "," "," "," "," "," "," "," "," "," "," "," "," "," "]
[null,null,"P11111111120023",1,"TO",9,"STAGE1",10," "," ","STAGE2",11,"AND",12,"ISOL",13," "," ","STAGE2",14," "," ","STAGE3"," "," "," "," "," "," "," "," "," "," "," "," "," "," "," "," "," "," "," "," "," "," "," "," "," "," "," "," "," "," "," "," "," "," "," "," "]
[null,null,"P11111111120024",1,"TO",9,"STAGE1",10," "," ","STAGE2",11,"AND",12,"ISOL",13," "," ","STAGE2",14," "," ","MONIT"," "," "," "," "," "," "," "," "," "," "," "," "," "," "," "," "," "," "," "," "," "," "," "," "," "," "," "," "," "," "," "," "," "," "," "," "]
[null,null,"P11111111120030",1,"TO",9,"STAGE1",10," "," ","STAGE2",11,"AND",12,"ISOL",13," "," ","STAGE3",14," "," ","ISOL"," "," "," "," "," "," "," "," "," "," "," "," "," "," "," "," "," "," "," "," "," "," "," "," "," "," "," "," "," "," "," "," "," "," "," "," "]
[null,null,"P11111111120031",1,"TO",9,"STAGE1",10," "," ","STAGE2",11,"AND",12,"ISOL",13," "," ","STAGE3",14," "," ","STAGE1"," "," "," "," "," "," "," "," "," "," "," "," "," "," "," "," "," "," "," "," "," "," "," "," "," "," "," "," "," "," "," "," "," "," "," "," "]
[null,null,"P11111111120032",1,"TO",9,"STAGE1",10," "," ","STAGE2",11,"AND",12,"ISOL",13," "," ","STAGE3",14," "," ","STAGE2"," "," "," "," "," "," "," "," "," "," "," "," "," "," "," "," "," "," "," "," "," "," "," "," "," "," "," "," "," "," "," "," "," "," "," "," "]
[null,null,"P11111111120033",1,"TO",9,"STAGE1",10," "," ","STAGE2",11,"AND",12,"ISOL",13,"AND",14,"STAGE3"," "," "," "," "," "," "," "," "," "," "," "," "," "," "," "," "," "," "," "," "," "," "," "," "," "," "," "," "," "," "," "," "," "," "," "," "," "," "," "," "]
[null,null,"P11111111120034",1,"TO",9,"STAGE1",10," "," ","STAGE2",11,"AND",12,"ISOL",13," "," ","STAGE3",14," "," ","MONIT"," "," "," "," "," "," "," "," "," "," "," "," "," "," "," "," "," "," "," "," "," "," "," "," "," "," "," "," "," "," "," "," "," "," "," "," "]
[null,null,"P11111111120040",1,"TO",9,"STAGE1",10," "," ","STAGE2",11,"AND",12,"ISOL",13," "," ","MONIT",14," "," ","ISOL"," "," "," "," "," "," "," "," "," "," "," "," "," "," "," "," "," "," "," "," "," "," "," "," "," "," "," "," "," "," "," "," "," "," "," "," "]
[null,null,"P11111111120041",1,"TO",9,"STAGE1",10," "," ","STAGE2",11,"AND",12,"ISOL",13," "," ","MONIT",14," "," ","STAGE1"," "," "," "," "," "," "," "," "," "," "," "," "," "," "," "," "," "," "," "," "," "," "," "," "," "," "," "," "," "," "," "," "," "," "," "," "]
[null,null,"P11111111120042",1,"TO",9,"STAGE1",10," "," ","STAGE2",11,"AND",12,"ISOL",13," "," ","MONIT",14," "," ","STAGE2"," "," "," "," "," "," "," "," "," "," "," "," "," "," "," "," "," "," "," "," "," "," "," "," "," "," "," "," "," "," "," "," "," "," "," "," "]
[null,null,"P11111111120043",1,"TO",9,"STAGE1",10," "," ","STAGE2",11,"AND",12,"ISOL",13," "," ","MONIT",14," "," ","STAGE3"," "," "," "," "," "," "," "," "," "," "," "," "," "," "," "," "," "," "," "," "," "," "," "," "," "," "," "," "," "," "," "," "," "," "," "," "]
[null,null,"P11111111120044",1,"TO",9,"STAGE1",10," "," ","STAGE2",11,"AND",12,"ISOL",13,"AND",14,"MONIT"," "," "," "," "," "," "," "," "," "," "," "," "," "," "," "," "," "," "," "," "," "," "," "," "," "," "," "," "," "," "," "," "," "," "," "," "," "," "," "," "]
[null,null,"P11111111120089",1,"TO",9,"STAGE1",10," "," ","STAGE2",11,"AND",12,"ISOL",13,"AND",14,"SHORT"," "," "," "," "," "," "," "," "," "," "," "," "," "," "," "," "," "," "," "," "," "," "," "," "," "," "," "," "," "," "," "," "," "," "," "," "," "," "," "," "]
[null,null,"P11111111120100",1,"TO",9,"STAGE1",10," "," ","STAGE2",11," "," ","ISOL",12," "," ","STAGE1",13,"AND",14,"ISOL"," "," "," "," "," "," "," "," "," "," "," "," "," "," "," "," "," "," "," "," "," "," "," "," "," "," "," "," "," "," "," "," "," "," "," "," "]
[null,null,"P11111111120101",1,"TO",9,"STAGE1",10," "," ","STAGE2",11," "," ","ISOL",12," "," ","STAGE1",13," "," ","ISOL",14," "," ","STAGE1"," "," "," "," "," "," "," "," "," "," "," "," "," "," "," "," "," "," "," "," "," "," "," "," "," "," "," "," "," "," "," "," "]
[null,null,"P11111111120102",1,"TO",9,"STAGE1",10," "," ","STAGE2",11," "," ","ISOL",12," "," ","STAGE1",13," "," ","ISOL",14," "," ","STAGE2"," "," "," "," "," "," "," "," "," "," "," "," "," "," "," "," "," "," "," "," "," "," "," "," "," "," "," "," "," "," "," "," "]
[null,null,"P11111111120103",1,"TO",9,"STAGE1",10," "," ","STAGE2",11," "," ","ISOL",12," "," ","STAGE1",13," "," ","ISOL",14," "," ","STAGE3"," "," "," "," "," "," "," "," "," "," "," "," "," "," "," "," "," "," "," "," "," "," "," "," "," "," "," "," "," "," "," "," "]
[null,null,"P11111111120104",1,"TO",9,"STAGE1",10," "," ","STAGE2",11," "," ","ISOL",12," "," ","STAGE1",13," "," ","ISOL",14," "," ","MONIT"," "," "," "," "," "," "," "," "," "," "," "," "," "," "," "," "," "," "," "," "," "," "," "," "," "," "," "," "," "," "," "," "]
[null,null,"P11111111120110",1,"TO",9,"STAGE1",10," "," ","STAGE2",11," "," ","ISOL",12,"AND",13,"STAGE1",14," "," ","ISOL"," "," "," "," "," "," "," "," "," "," "," "," "," "," "," "," "," "," "," "," "," "," "," "," "," "," "," "," "," "," "," "," "," "," "," "," "]
[null,null,"P11111111120111",1,"TO",9,"STAGE1",10," "," ","STAGE2",11," "," ","ISOL",12,"TO",14,"STAGE1"," "," "," "," "," "," "," "," "," "," "," "," "," "," "," "," "," "," "," "," "," "," "," "," "," "," "," "," "," "," "," "," "," "," "," "," "," "," "," "," "]
[null,null,"P11111111120112",1,"TO",9,"STAGE1",10," "," ","STAGE2",11," "," ","ISOL",12,"AND",13,"STAGE1",14," "," ","STAGE2"," "," "," "," "," "," "," "," "," "," "," "," "," "," "," "," "," "," "," "," "," "," "," "," "," "," "," "," "," "," "," "," "," "," "," "," "]
[null,null,"P11111111120113",1,"TO",9,"STAGE1",10," "," ","STAGE2",11," "," ","ISOL",12,"AND",13,"STAGE1",14," "," ","STAGE3"," "," "," "," "," "," "," "," "," "," "," "," "," "," "," "," "," "," "," "," "," "," "," "," "," "," "," "," "," "," "," "," "," "," "," "," "]
[null,null,"P11111111120114",1,"TO",9,"STAGE1",10," "," ","STAGE2",11," "," ","ISOL",12,"AND",13,"STAGE1",14," "," ","MONIT"," "," "," "," "," "," "," "," "," "," "," "," "," "," "," "," "," "," "," "," "," "," "," "," "," "," "," "," "," "," "," "," "," "," "," "," "]
[null,null,"P11111111120120",1,"TO",9,"STAGE1",10," "," ","STAGE2",11," "," ","ISOL",12," "," ","STAGE1",13," "," ","STAGE2",14," "," ","ISOL"," "," "," "," "," "," "," "," "," "," "," "," "," "," "," "," "," "," "," "," "," "," "," "," "," "," "," "," "," "," "," "," "]
[null,null,"P11111111120121",1,"TO",9,"STAGE1",10," "," ","STAGE2",11," "," ","ISOL",12," "," ","STAGE1",13," "," ","STAGE2",14," "," ","STAGE1"," "," "," "," "," "," "," "," "," "," "," "," "," "," "," "," "," "," "," "," "," "," "," "," "," "," "," "," "," "," "," "," "]
[null,null,"P11111111120122",1,"TO",9,"STAGE1",10," "," ","STAGE2",11," "," ","ISOL",12," "," ","STAGE1",13,"AND",14,"STAGE2"," "," "," "," "," "," "," "," "," "," "," "," "," "," "," "," "," "," "," "," "," "," "," "," "," "," "," "," "," "," "," "," "," "," "," "," "]
[null,null,"P11111111120123",1,"TO",9,"STAGE1",10," "," ","STAGE2",11," "," ","ISOL",12," "," ","STAGE1",13," "," ","STAGE2",14," "," ","STAGE3"," "," "," "," "," "," "," "," "," "," "," "," "," "," "," "," "," "," "," "," "," "," "," "," "," "," "," "," "," "," "," "," "]
[null,null,"P11111111120124",1,"TO",9,"STAGE1",10," "," ","STAGE2",11," "," ","ISOL",12," "," ","STAGE1",13," "," ","STAGE2",14," "," ","MONIT"," "," "," "," "," "," "," "," "," "," "," "," "," "," "," "," "," "," "," "," "," "," "," "," "," "," "," "," "," "," "," "," "]
[null,null,"P11111111120130",1,"TO",9,"STAGE1",10," "," ","STAGE2",11," "," ","ISOL",12," "," ","STAGE1",13," "," ","STAGE3",14," "," ","ISOL"," "," "," "," "," "," "," "," "," "," "," "," "," "," "," "," "," "," "," "," "," "," "," "," "," "," "," "," "," "," "," "," "]
[null,null,"P11111111120131",1,"TO",9,"STAGE1",10," "," ","STAGE2",11," "," ","ISOL",12," "," ","STAGE1",13," "," ","STAGE3",14," "," ","STAGE1"," "," "," "," "," "," "," "," "," "," "," "," "," "," "," "," "," "," "," "," "," "," "," "," "," "," "," "," "," "," "," "," "]
[null,null,"P11111111120132",1,"TO",9,"STAGE1",10," "," ","STAGE2",11," "," ","ISOL",12," "," ","STAGE1",13," "," ","STAGE3",14," "," ","STAGE2"," "," "," "," "," "," "," "," "," "," "," "," "," "," "," "," "," "," "," "," "," "," "," "," "," "," "," "," "," "," "," "," "]
[null,null,"P11111111120133",1,"TO",9,"STAGE1",10," "," ","STAGE2",11," "," ","ISOL",12," "," ","STAGE1",13,"AND",14,"STAGE3"," "," "," "," "," "," "," "," "," "," "," "," "," "," "," "," "," "," "," "," "," "," "," "," "," "," "," "," "," "," "," "," "," "," "," "," "]
[null,null,"P11111111120134",1,"TO",9,"STAGE1",10," "," ","STAGE2",11," "," ","ISOL",12," "," ","STAGE1",13," "," ","STAGE3",14," "," ","MONIT"," "," "," "," "," "," "," "," "," "," "," "," "," "," "," "," "," "," "," "," "," "," "," "," "," "," "," "," "," "," "," "," "]
[null,null,"P11111111120140",1,"TO",9,"STAGE1",10," "," ","STAGE2",11," "," ","ISOL",12," "," ","STAGE1",13," "," ","MONIT",14," "," ","ISOL"," "," "," "," "," "," "," "," "," "," "," "," "," "," "," "," "," "," "," "," "," "," "," "," "," "," "," "," "," "," "," "," "]
[null,null,"P11111111120141",1,"TO",9,"STAGE1",10," "," ","STAGE2",11," "," ","ISOL",12," "," ","STAGE1",13," "," ","MONIT",14," "," ","STAGE1"," "," "," "," "," "," "," "," "," "," "," "," "," "," "," "," "," "," "," "," "," "," "," "," "," "," "," "," "," "," "," "," "]
[null,null,"P11111111120142",1,"TO",9,"STAGE1",10," "," ","STAGE2",11," "," ","ISOL",12," "," ","STAGE1",13," "," ","MONIT",14," "," ","STAGE2"," "," "," "," "," "," "," "," "," "," "," "," "," "," "," "," "," "," "," "," "," "," "," "," "," "," "," "," "," "," "," "," "]
[null,null,"P11111111120143",1,"TO",9,"STAGE1",10," "," ","STAGE2",11," "," ","ISOL",12," "," ","STAGE1",13," "," ","MONIT",14," "," ","STAGE3"," "," "," "," "," "," "," "," "," "," "," "," "," "," "," "," "," "," "," "," "," "," "," "," "," "," "," "," "," "," "," "," "]
[null,null,"P11111111120144",1,"TO",9,"STAGE1",10," "," ","STAGE2",11," "," ","ISOL",12," "," ","STAGE1",13,"AND",14,"MONIT"," "," "," "," "," "," "," "," "," "," "," "," "," "," "," "," "," "," "," "," "," "," "," "," "," "," "," "," "," "," "," "," "," "," "," "," "]
[null,null,"P11111111120189",1,"TO",9,"STAGE1",10," "," ","STAGE2",11," "," ","ISOL",12," "," ","STAGE1",13,"AND",14,"SHORT"," "," "," "," "," "," "," "," "," "," "," "," "," "," "," "," "," "," "," "," "," "," "," "," "," "," "," "," "," "," "," "," "," "," "," "," "]
[null,null,"P11111111120200",1,"TO",9,"STAGE1",10," "," ","STAGE2",11," "," ","ISOL",12," "," ","STAGE2",13,"AND",14,"ISOL"," "," "," "," "," "," "," "," "," "," "," "," "," "," "," "," "," "," "," "," "," "," "," "," "," "," "," "," "," "," "," "," "," "," "," "," "]
[null,null,"P11111111120201",1,"TO",9,"STAGE1",10," "," ","STAGE2",11," "," ","ISOL",12," "," ","STAGE2",13," "," ","ISOL",14," "," ","STAGE1"," "," "," "," "," "," "," "," "," "," "," "," "," "," "," "," "," "," "," "," "," "," "," "," "," "," "," "," "," "," "," "," "]
[null,null,"P11111111120202",1,"TO",9,"STAGE1",10," "," ","STAGE2",11," "," ","ISOL",12," "," ","STAGE2",13," "," ","ISOL",14," "," ","STAGE2"," "," "," "," "," "," "," "," "," "," "," "," "," "," "," "," "," "," "," "," "," "," "," "," "," "," "," "," "," "," "," "," "]
[null,null,"P11111111120203",1,"TO",9,"STAGE1",10," "," ","STAGE2",11," "," ","ISOL",12," "," ","STAGE2",13," "," ","ISOL",14," "," ","STAGE3"," "," "," "," "," "," "," "," "," "," "," "," "," "," "," "," "," "," "," "," "," "," "," "," "," "," "," "," "," "," "," "," "]
[null,null,"P11111111120204",1,"TO",9,"STAGE1",10," "," ","STAGE2",11," "," ","ISOL",12," "," ","STAGE2",13," "," ","ISOL",14," "," ","MONIT"," "," "," "," "," "," "," "," "," "," "," "," "," "," "," "," "," "," "," "," "," "," "," "," "," "," "," "," "," "," "," "," "]
[null,null,"P11111111120210",1,"TO",9,"STAGE1",10," "," ","STAGE2",11," "," ","ISOL",12," "," ","STAGE2",13," "," ","STAGE1",14," "," ","ISOL"," "," "," "," "," "," "," "," "," "," "," "," "," "," "," "," "," "," "," "," "," "," "," "," "," "," "," "," "," "," "," "," "]
[null,null,"P11111111120211",1,"TO",9,"STAGE1",10," "," ","STAGE2",11," "," ","ISOL",12," "," ","STAGE2",13,"AND",14,"STAGE1"," "," "," "," "," "," "," "," "," "," "," "," "," "," "," "," "," "," "," "," "," "," "," "," "," "," "," "," "," "," "," "," "," "," "," "," "]
[null,null,"P11111111120212",1,"TO",9,"STAGE1",10," "," ","STAGE2",11," "," ","ISOL",12," "," ","STAGE2",13," "," ","STAGE1",14," "," ","STAGE2"," "," "," "," "," "," "," "," "," "," "," "," "," "," "," "," "," "," "," "," "," "," "," "," "," "," "," "," "," "," "," "," "]
[null,null,"P11111111120213",1,"TO",9,"STAGE1",10," "," ","STAGE2",11," "," ","ISOL",12," "," ","STAGE2",13," "," ","STAGE1",14," "," ","STAGE3"," "," "," "," "," "," "," "," "," "," "," "," "," "," "," "," "," "," "," "," "," "," "," "," "," "," "," "," "," "," "," "," "]
[null,null,"P11111111120214",1,"TO",9,"STAGE1",10," "," ","STAGE2",11," "," ","ISOL",12," "," ","STAGE2",13," "," ","STAGE1",14," "," ","MONIT"," "," "," "," "," "," "," "," "," "," "," "," "," "," "," "," "," "," "," "," "," "," "," "," "," "," "," "," "," "," "," "," "]
[null,null,"P11111111120220",1,"TO",9,"STAGE1",10," "," ","STAGE2",11," "," ","ISOL",12,"AND",13,"STAGE2",14," "," ","ISOL"," "," "," "," "," "," "," "," "," "," "," "," "," "," "," "," "," "," "," "," "," "," "," "," "," "," "," "," "," "," "," "," "," "," "," "," "]
[null,null,"P11111111120221",1,"TO",9,"STAGE1",10," "," ","STAGE2",11," "," ","ISOL",12,"AND",13,"STAGE2",14," "," ","STAGE1"," "," "," "," "," "," "," "," "," "," "," "," "," "," "," "," "," "," "," "," "," "," "," "," "," "," "," "," "," "," "," "," "," "," "," "," "]
[null,null,"P11111111120222",1,"TO",9,"STAGE1",10," "," ","STAGE2",11," "," ","ISOL",12,"TO",14,"STAGE2"," "," "," "," "," "," "," "," "," "," "," "," "," "," "," "," "," "," "," "," "," "," "," "," "," "," "," "," "," "," "," "," "," "," "," "," "," "," "," "," "]
[null,null,"P11111111120223",1,"TO",9,"STAGE1",10," "," ","STAGE2",11," "," ","ISOL",12,"AND",13,"STAGE2",14," "," ","STAGE3"," "," "," "," "," "," "," "," "," "," "," "," "," "," "," "," "," "," "," "," "," "," "," "," "," "," "," "," "," "," "," "," "," "," "," "," "]
[null,null,"P11111111120224",1,"TO",9,"STAGE1",10," "," ","STAGE2",11," "," ","ISOL",12,"AND",13,"STAGE2",14," "," ","MONIT"," "," "," "," "," "," "," "," "," "," "," "," "," "," "," "," "," "," "," "," "," "," "," "," "," "," "," "," "," "," "," "," "," "," "," "," "]
[null,null,"P11111111120230",1,"TO",9,"STAGE1",10," "," ","STAGE2",11," "," ","ISOL",12," "," ","STAGE2",13," "," ","STAGE3",14," "," ","ISOL"," "," "," "," "," "," "," "," "," "," "," "," "," "," "," "," "," "," "," "," "," "," "," "," "," "," "," "," "," "," "," "," "]
[null,null,"P11111111120231",1,"TO",9,"STAGE1",10," "," ","STAGE2",11," "," ","ISOL",12," "," ","STAGE2",13," "," ","STAGE3",14," "," ","STAGE1"," "," "," "," "," "," "," "," "," "," "," "," "," "," "," "," "," "," "," "," "," "," "," "," "," "," "," "," "," "," "," "," "]
[null,null,"P11111111120232",1,"TO",9,"STAGE1",10," "," ","STAGE2",11," "," ","ISOL",12," "," ","STAGE2",13," "," ","STAGE3",14," "," ","STAGE2"," "," "," "," "," "," "," "," "," "," "," "," "," "," "," "," "," "," "," "," "," "," "," "," "," "," "," "," "," "," "," "," "]
[null,null,"P11111111120233",1,"TO",9,"STAGE1",10," "," ","STAGE2",11," "," ","ISOL",12," "," ","STAGE2",13,"AND",14,"STAGE3"," "," "," "," "," "," "," "," "," "," "," "," "," "," "," "," "," "," "," "," "," "," "," "," "," "," "," "," "," "," "," "," "," "," "," "," "]
[null,null,"P11111111120234",1,"TO",9,"STAGE1",10," "," ","STAGE2",11," "," ","ISOL",12," "," ","STAGE2",13," "," ","STAGE3",14," "," ","MONIT"," "," "," "," "," "," "," "," "," "," "," "," "," "," "," "," "," "," "," "," "," "," "," "," "," "," "," "," "," "," "," "," "]
[null,null,"P11111111120240",1,"TO",9,"STAGE1",10," "," ","STAGE2",11," "," ","ISOL",12," "," ","STAGE2",13," "," ","MONIT",14," "," ","ISOL"," "," "," "," "," "," "," "," "," "," "," "," "," "," "," "," "," "," "," "," "," "," "," "," "," "," "," "," "," "," "," "," "]
[null,null,"P11111111120241",1,"TO",9,"STAGE1",10," "," ","STAGE2",11," "," ","ISOL",12," "," ","STAGE2",13," "," ","MONIT",14," "," ","STAGE1"," "," "," "," "," "," "," "," "," "," "," "," "," "," "," "," "," "," "," "," "," "," "," "," "," "," "," "," "," "," "," "," "]
[null,null,"P11111111120242",1,"TO",9,"STAGE1",10," "," ","STAGE2",11," "," ","ISOL",12," "," ","STAGE2",13," "," ","MONIT",14," "," ","STAGE2"," "," "," "," "," "," "," "," "," "," "," "," "," "," "," "," "," "," "," "," "," "," "," "," "," "," "," "," "," "," "," "," "]
[null,null,"P11111111120243",1,"TO",9,"STAGE1",10," "," ","STAGE2",11," "," ","ISOL",12," "," ","STAGE2",13," "," ","MONIT",14," "," ","STAGE3"," "," "," "," "," "," "," "," "," "," "," "," "," "," "," "," "," "," "," "," "," "," "," "," "," "," "," "," "," "," "," "," "]
[null,null,"P11111111120244",1,"TO",9,"STAGE1",10," "," ","STAGE2",11," "," ","ISOL",12," "," ","STAGE2",13,"AND",14,"MONIT"," "," "," "," "," "," "," "," "," "," "," "," "," "," "," "," "," "," "," "," "," "," "," "," "," "," "," "," "," "," "," "," "," "," "," "," "]
[null,null,"P11111111120289",1,"TO",9,"STAGE1",10," "," ","STAGE2",11," "," ","ISOL",12," "," ","STAGE2",13,"AND",14,"SHORT"," "," "," "," "," "," "," "," "," "," "," "," "," "," "," "," "," "," "," "," "," "," "," "," "," "," "," "," "," "," "," "," "," "," "," "," "]
[null,null,"P11111111120300",1,"TO",9,"STAGE1",10," "," ","STAGE2",11," "," ","ISOL",12," "," ","STAGE3",13,"AND",14,"ISOL"," "," "," "," "," "," "," "," "," "," "," "," "," "," "," "," "," "," "," "," "," "," "," "," "," "," "," "," "," "," "," "," "," "," "," "," "]
[null,null,"P11111111120301",1,"TO",9,"STAGE1",10," "," ","STAGE2",11," "," ","ISOL",12," "," ","STAGE3",13," "," ","ISOL",14," "," ","STAGE1"," "," "," "," "," "," "," "," "," "," "," "," "," "," "," "," "," "," "," "," "," "," "," "," "," "," "," "," "," "," "," "," "]
[null,null,"P11111111120302",1,"TO",9,"STAGE1",10," "," ","STAGE2",11," "," ","ISOL",12," "," ","STAGE3",13," "," ","ISOL",14," "," ","STAGE2"," "," "," "," "," "," "," "," "," "," "," "," "," "," "," "," "," "," "," "," "," "," "," "," "," "," "," "," "," "," "," "," "]
[null,null,"P11111111120303",1,"TO",9,"STAGE1",10," "," ","STAGE2",11," "," ","ISOL",12," "," ","STAGE3",13," "," ","ISOL",14," "," ","STAGE3"," "," "," "," "," "," "," "," "," "," "," "," "," "," "," "," "," "," "," "," "," "," "," "," "," "," "," "," "," "," "," "," "]
[null,null,"P11111111120304",1,"TO",9,"STAGE1",10," "," ","STAGE2",11," "," ","ISOL",12," "," ","STAGE3",13," "," ","ISOL",14," "," ","MONIT"," "," "," "," "," "," "," "," "," "," "," "," "," "," "," "," "," "," "," "," "," "," "," "," "," "," "," "," "," "," "," "," "]
[null,null,"P11111111120310",1,"TO",9,"STAGE1",10," "," ","STAGE2",11," "," ","ISOL",12," "," ","STAGE3",13," "," ","STAGE1",14," "," ","ISOL"," "," "," "," "," "," "," "," "," "," "," "," "," "," "," "," "," "," "," "," "," "," "," "," "," "," "," "," "," "," "," "," "]
[null,null,"P11111111120311",1,"TO",9,"STAGE1",10," "," ","STAGE2",11," "," ","ISOL",12," "," ","STAGE3",13,"AND",14,"STAGE1"," "," "," "," "," "," "," "," "," "," "," "," "," "," "," "," "," "," "," "," "," "," "," "," "," "," "," "," "," "," "," "," "," "," "," "," "]
[null,null,"P11111111120312",1,"TO",9,"STAGE1",10," "," ","STAGE2",11," "," ","ISOL",12," "," ","STAGE3",13," "," ","STAGE1",14," "," ","STAGE2"," "," "," "," "," "," "," "," "," "," "," "," "," "," "," "," "," "," "," "," "," "," "," "," "," "," "," "," "," "," "," "," "]
[null,null,"P11111111120313",1,"TO",9,"STAGE1",10," "," ","STAGE2",11," "," ","ISOL",12," "," ","STAGE3",13," "," ","STAGE1",14," "," ","STAGE3"," "," "," "," "," "," "," "," "," "," "," "," "," "," "," "," "," "," "," "," "," "," "," "," "," "," "," "," "," "," "," "," "]
[null,null,"P11111111120314",1,"TO",9,"STAGE1",10," "," ","STAGE2",11," "," ","ISOL",12," "," ","STAGE3",13," "," ","STAGE1",14," "," ","MONIT"," "," "," "," "," "," "," "," "," "," "," "," "," "," "," "," "," "," "," "," "," "," "," "," "," "," "," "," "," "," "," "," "]
[null,null,"P11111111120320",1,"TO",9,"STAGE1",10," "," ","STAGE2",11," "," ","ISOL",12," "," ","STAGE3",13," "," ","STAGE2",14," "," ","ISOL"," "," "," "," "," "," "," "," "," "," "," "," "," "," "," "," "," "," "," "," "," "," "," "," "," "," "," "," "," "," "," "," "]
[null,null,"P11111111120321",1,"TO",9,"STAGE1",10," "," ","STAGE2",11," "," ","ISOL",12," "," ","STAGE3",13," "," ","STAGE2",14," "," ","STAGE1"," "," "," "," "," "," "," "," "," "," "," "," "," "," "," "," "," "," "," "," "," "," "," "," "," "," "," "," "," "," "," "," "]
[null,null,"P11111111120322",1,"TO",9,"STAGE1",10," "," ","STAGE2",11," "," ","ISOL",12," "," ","STAGE3",13,"AND",14,"STAGE2"," "," "," "," "," "," "," "," "," "," "," "," "," "," "," "," "," "," "," "," "," "," "," "," "," "," "," "," "," "," "," "," "," "," "," "," "]
[null,null,"P11111111120323",1,"TO",9,"STAGE1",10," "," ","STAGE2",11," "," ","ISOL",12," "," ","STAGE3",13," "," ","STAGE2",14," "," ","STAGE3"," "," "," "," "," "," "," "," "," "," "," "," "," "," "," "," "," "," "," "," "," "," "," "," "," "," "," "," "," "," "," "," "]
[null,null,"P11111111120324",1,"TO",9,"STAGE1",10," "," ","STAGE2",11," "," ","ISOL",12," "," ","STAGE3",13," "," ","STAGE2",14," "," ","MONIT"," "," "," "," "," "," "," "," "," "," "," "," "," "," "," "," "," "," "," "," "," "," "," "," "," "," "," "," "," "," "," "," "]
[null,null,"P11111111120330",1,"TO",9,"STAGE1",10," "," ","STAGE2",11," "," ","ISOL",12,"AND",13,"STAGE3",14," "," ","ISOL"," "," "," "," "," "," "," "," "," "," "," "," "," "," "," "," "," "," "," "," "," "," "," "," "," "," "," "," "," "," "," "," "," "," "," "," "]
[null,null,"P11111111120331",1,"TO",9,"STAGE1",10," "," ","STAGE2",11," "," ","ISOL",12,"AND",13,"STAGE3",14," "," ","STAGE1"," "," "," "," "," "," "," "," "," "," "," "," "," "," "," "," "," "," "," "," "," "," "," "," "," "," "," "," "," "," "," "," "," "," "," "," "]
[null,null,"P11111111120332",1,"TO",9,"STAGE1",10," "," ","STAGE2",11," "," ","ISOL",12,"AND",13,"STAGE3",14," "," ","STAGE2"," "," "," "," "," "," "," "," "," "," "," "," "," "," "," "," "," "," "," "," "," "," "," "," "," "," "," "," "," "," "," "," "," "," "," "," "]
[null,null,"P11111111120333",1,"TO",9,"STAGE1",10," "," ","STAGE2",11," "," ","ISOL",12,"TO",14,"STAGE3"," "," "," "," "," "," "," "," "," "," "," "," "," "," "," "," "," "," "," "," "," "," "," "," "," "," "," "," "," "," "," "," "," "," "," "," "," "," "," "," "]
[null,null,"P11111111120334",1,"TO",9,"STAGE1",10," "," ","STAGE2",11," "," ","ISOL",12,"AND",13,"STAGE3",14," "," ","MONIT"," "," "," "," "," "," "," "," "," "," "," "," "," "," "," "," "," "," "," "," "," "," "," "," "," "," "," "," "," "," "," "," "," "," "," "," "]
[null,null,"P11111111120340",1,"TO",9,"STAGE1",10," "," ","STAGE2",11," "," ","ISOL",12," "," ","STAGE3",13," "," ","MONIT",14," "," ","ISOL"," "," "," "," "," "," "," "," "," "," "," "," "," "," "," "," "," "," "," "," "," "," "," "," "," "," "," "," "," "," "," "," "]
[null,null,"P11111111120341",1,"TO",9,"STAGE1",10," "," ","STAGE2",11," "," ","ISOL",12," "," ","STAGE3",13," "," ","MONIT",14," "," ","STAGE1"," "," "," "," "," "," "," "," "," "," "," "," "," "," "," "," "," "," "," "," "," "," "," "," "," "," "," "," "," "," "," "," "]
[null,null,"P11111111120342",1,"TO",9,"STAGE1",10," "," ","STAGE2",11," "," ","ISOL",12," "," ","STAGE3",13," "," ","MONIT",14," "," ","STAGE2"," "," "," "," "," "," "," "," "," "," "," "," "," "," "," "," "," "," "," "," "," "," "," "," "," "," "," "," "," "," "," "," "]
[null,null,"P11111111120343",1,"TO",9,"STAGE1",10," "," ","STAGE2",11," "," ","ISOL",12," "," ","STAGE3",13," "," ","MONIT",14," "," ","STAGE3"," "," "," "," "," "," "," "," "," "," "," "," "," "," "," "," "," "," "," "," "," "," "," "," "," "," "," "," "," "," "," "," "]
[null,null,"P11111111120344",1,"TO",9,"STAGE1",10," "," ","STAGE2",11," "," ","ISOL",12," "," ","STAGE3",13,"AND",14,"MONIT"," "," "," "," "," "," "," "," "," "," "," "," "," "," "," "," "," "," "," "," "," "," "," "," "," "," "," "," "," "," "," "," "," "," "," "," "]
[null,null,"P11111111120389",1,"TO",9,"STAGE1",10," "," ","STAGE2",11," "," ","ISOL",12," "," ","STAGE3",13,"AND",14,"SHORT"," "," "," "," "," "," "," "," "," "," "," "," "," "," "," "," "," "," "," "," "," "," "," "," "," "," "," "," "," "," "," "," "," "," "," "," "]
[null,null,"P11111111120400",1,"TO",9,"STAGE1",10," "," ","STAGE2",11," "," ","ISOL",12," "," ","MONIT",13,"AND",14,"ISOL"," "," "," "," "," "," "," "," "," "," "," "," "," "," "," "," "," "," "," "," "," "," "," "," "," "," "," "," "," "," "," "," "," "," "," "," "]
[null,null,"P11111111120401",1,"TO",9,"STAGE1",10," "," ","STAGE2",11," "," ","ISOL",12," "," ","MONIT",13," "," ","ISOL",14," "," ","STAGE1"," "," "," "," "," "," "," "," "," "," "," "," "," "," "," "," "," "," "," "," "," "," "," "," "," "," "," "," "," "," "," "," "]
[null,null,"P11111111120402",1,"TO",9,"STAGE1",10," "," ","STAGE2",11," "," ","ISOL",12," "," ","MONIT",13," "," ","ISOL",14," "," ","STAGE2"," "," "," "," "," "," "," "," "," "," "," "," "," "," "," "," "," "," "," "," "," "," "," "," "," "," "," "," "," "," "," "," "]
[null,null,"P11111111120403",1,"TO",9,"STAGE1",10," "," ","STAGE2",11," "," ","ISOL",12," "," ","MONIT",13," "," ","ISOL",14," "," ","STAGE3"," "," "," "," "," "," "," "," "," "," "," "," "," "," "," "," "," "," "," "," "," "," "," "," "," "," "," "," "," "," "," "," "]
[null,null,"P11111111120404",1,"TO",9,"STAGE1",10," "," ","STAGE2",11," "," ","ISOL",12," "," ","MONIT",13," "," ","ISOL",14," "," ","MONIT"," "," "," "," "," "," "," "," "," "," "," "," "," "," "," "," "," "," "," "," "," "," "," "," "," "," "," "," "," "," "," "," "]
[null,null,"P11111111120410",1,"TO",9,"STAGE1",10," "," ","STAGE2",11," "," ","ISOL",12," "," ","MONIT",13," "," ","STAGE1",14," "," ","ISOL"," "," "," "," "," "," "," "," "," "," "," "," "," "," "," "," "," "," "," "," "," "," "," "," "," "," "," "," "," "," "," "," "]
[null,null,"P11111111120411",1,"TO",9,"STAGE1",10," "," ","STAGE2",11," "," ","ISOL",12," "," ","MONIT",13,"AND",14,"STAGE1"," "," "," "," "," "," "," "," "," "," "," "," "," "," "," "," "," "," "," "," "," "," "," "," "," "," "," "," "," "," "," "," "," "," "," "," "]
[null,null,"P11111111120412",1,"TO",9,"STAGE1",10," "," ","STAGE2",11," "," ","ISOL",12," "," ","MONIT",13," "," ","STAGE1",14," "," ","STAGE2"," "," "," "," "," "," "," "," "," "," "," "," "," "," "," "," "," "," "," "," "," "," "," "," "," "," "," "," "," "," "," "," "]
[null,null,"P11111111120413",1,"TO",9,"STAGE1",10," "," ","STAGE2",11," "," ","ISOL",12," "," ","MONIT",13," "," ","STAGE1",14," "," ","STAGE3"," "," "," "," "," "," "," "," "," "," "," "," "," "," "," "," "," "," "," "," "," "," "," "," "," "," "," "," "," "," "," "," "]
[null,null,"P11111111120414",1,"TO",9,"STAGE1",10," "," ","STAGE2",11," "," ","ISOL",12," "," ","MONIT",13," "," ","STAGE1",14," "," ","MONIT"," "," "," "," "," "," "," "," "," "," "," "," "," "," "," "," "," "," "," "," "," "," "," "," "," "," "," "," "," "," "," "," "]
[null,null,"P11111111120420",1,"TO",9,"STAGE1",10," "," ","STAGE2",11," "," ","ISOL",12," "," ","MONIT",13," "," ","STAGE2",14," "," ","ISOL"," "," "," "," "," "," "," "," "," "," "," "," "," "," "," "," "," "," "," "," "," "," "," "," "," "," "," "," "," "," "," "," "]
[null,null,"P11111111120421",1,"TO",9,"STAGE1",10," "," ","STAGE2",11," "," ","ISOL",12," "," ","MONIT",13," "," ","STAGE2",14," "," ","STAGE1"," "," "," "," "," "," "," "," "," "," "," "," "," "," "," "," "," "," "," "," "," "," "," "," "," "," "," "," "," "," "," "," "]
[null,null,"P11111111120422",1,"TO",9,"STAGE1",10," "," ","STAGE2",11," "," ","ISOL",12," "," ","MONIT",13,"AND",14,"STAGE2"," "," "," "," "," "," "," "," "," "," "," "," "," "," "," "," "," "," "," "," "," "," "," "," "," "," "," "," "," "," "," "," "," "," "," "," "]
[null,null,"P11111111120423",1,"TO",9,"STAGE1",10," "," ","STAGE2",11," "," ","ISOL",12," "," ","MONIT",13," "," ","STAGE2",14," "," ","STAGE3"," "," "," "," "," "," "," "," "," "," "," "," "," "," "," "," "," "," "," "," "," "," "," "," "," "," "," "," "," "," "," "," "]
[null,null,"P11111111120424",1,"TO",9,"STAGE1",10," "," ","STAGE2",11," "," ","ISOL",12," "," ","MONIT",13," "," ","STAGE2",14," "," ","MONIT"," "," "," "," "," "," "," "," "," "," "," "," "," "," "," "," "," "," "," "," "," "," "," "," "," "," "," "," "," "," "," "," "]
[null,null,"P11111111120430",1,"TO",9,"STAGE1",10," "," ","STAGE2",11," "," ","ISOL",12," "," ","MONIT",13," "," ","STAGE3",14," "," ","ISOL"," "," "," "," "," "," "," "," "," "," "," "," "," "," "," "," "," "," "," "," "," "," "," "," "," "," "," "," "," "," "," "," "]
[null,null,"P11111111120431",1,"TO",9,"STAGE1",10," "," ","STAGE2",11," "," ","ISOL",12," "," ","MONIT",13," "," ","STAGE3",14," "," ","STAGE1"," "," "," "," "," "," "," "," "," "," "," "," "," "," "," "," "," "," "," "," "," "," "," "," "," "," "," "," "," "," "," "," "]
[null,null,"P11111111120432",1,"TO",9,"STAGE1",10," "," ","STAGE2",11," "," ","ISOL",12," "," ","MONIT",13," "," ","STAGE3",14," "," ","STAGE2"," "," "," "," "," "," "," "," "," "," "," "," "," "," "," "," "," "," "," "," "," "," "," "," "," "," "," "," "," "," "," "," "]
[null,null,"P11111111120433",1,"TO",9,"STAGE1",10," "," ","STAGE2",11," "," ","ISOL",12," "," ","MONIT",13,"AND",14,"STAGE3"," "," "," "," "," "," "," "," "," "," "," "," "," "," "," "," "," "," "," "," "," "," "," "," "," "," "," "," "," "," "," "," "," "," "," "," "]
[null,null,"P11111111120434",1,"TO",9,"STAGE1",10," "," ","STAGE2",11," "," ","ISOL",12," "," ","MONIT",13," "," ","STAGE3",14," "," ","MONIT"," "," "," "," "," "," "," "," "," "," "," "," "," "," "," "," "," "," "," "," "," "," "," "," "," "," "," "," "," "," "," "," "]
[null,null,"P11111111120440",1,"TO",9,"STAGE1",10," "," ","STAGE2",11," "," ","ISOL",12,"AND",13,"MONIT",14," "," ","ISOL"," "," "," "," "," "," "," "," "," "," "," "," "," "," "," "," "," "," "," "," "," "," "," "," "," "," "," "," "," "," "," "," "," "," "," "," "]
[null,null,"P11111111120441",1,"TO",9,"STAGE1",10," "," ","STAGE2",11," "," ","ISOL",12,"AND",13,"MONIT",14," "," ","STAGE1"," "," "," "," "," "," "," "," "," "," "," "," "," "," "," "," "," "," "," "," "," "," "," "," "," "," "," "," "," "," "," "," "," "," "," "," "]
[null,null,"P11111111120442",1,"TO",9,"STAGE1",10," "," ","STAGE2",11," "," ","ISOL",12,"AND",13,"MONIT",14," "," ","STAGE2"," "," "," "," "," "," "," "," "," "," "," "," "," "," "," "," "," "," "," "," "," "," "," "," "," "," "," "," "," "," "," "," "," "," "," "," "]
[null,null,"P11111111120443",1,"TO",9,"STAGE1",10," "," ","STAGE2",11," "," ","ISOL",12,"AND",13,"MONIT",14," "," ","STAGE3"," "," "," "," "," "," "," "," "," "," "," "," "," "," "," "," "," "," "," "," "," "," "," "," "," "," "," "," "," "," "," "," "," "," "," "," "]
[null,null,"P11111111120444",1,"TO",9,"STAGE1",10," "," ","STAGE2",11," "," ","ISOL",12,"TO",14,"MONIT"," "," "," "," "," "," "," "," "," "," "," "," "," "," "," "," "," "," "," "," "," "," "," "," "," "," "," "," "," "," "," "," "," "," "," "," "," "," "," "," "]
[null,null,"P11111111120489",1,"TO",9,"STAGE1",10," "," ","STAGE2",11," "," ","ISOL",12," "," ","MONIT",13,"AND",14,"SHORT"," "," "," "," "," "," "," "," "," "," "," "," "," "," "," "," "," "," "," "," "," "," "," "," "," "," "," "," "," "," "," "," "," "," "," "," "]
[null,null,"P11111111121000",1,"TO",9,"STAGE1",10," "," ","STAGE2",11," "," ","STAGE1",12,"TO",14,"ISOL"," "," "," "," "," "," "," "," "," "," "," "," "," "," "," "," "," "," "," "," "," "," "," "," "," "," "," "," "," "," "," "," "," "," "," "," "," "," "," "," "]
[null,null,"P11111111121001",1,"TO",9,"STAGE1",10," "," ","STAGE2",11," "," ","STAGE1",12,"AND",13,"ISOL",14," "," ","STAGE1"," "," "," "," "," "," "," "," "," "," "," "," "," "," "," "," "," "," "," "," "," "," "," "," "," "," "," "," "," "," "," "," "," "," "," "," "]
[null,null,"P11111111121002",1,"TO",9,"STAGE1",10," "," ","STAGE2",11," "," ","STAGE1",12,"AND",13,"ISOL",14," "," ","STAGE2"," "," "," "," "," "," "," "," "," "," "," "," "," "," "," "," "," "," "," "," "," "," "," "," "," "," "," "," "," "," "," "," "," "," "," "," "]
[null,null,"P11111111121003",1,"TO",9,"STAGE1",10," "," ","STAGE2",11," "," ","STAGE1",12,"AND",13,"ISOL",14," "," ","STAGE3"," "," "," "," "," "," "," "," "," "," "," "," "," "," "," "," "," "," "," "," "," "," "," "," "," "," "," "," "," "," "," "," "," "," "," "," "]
[null,null,"P11111111121004",1,"TO",9,"STAGE1",10," "," ","STAGE2",11," "," ","STAGE1",12,"AND",13,"ISOL",14," "," ","MONIT"," "," "," "," "," "," "," "," "," "," "," "," "," "," "," "," "," "," "," "," "," "," "," "," "," "," "," "," "," "," "," "," "," "," "," "," "]
[null,null,"P11111111121010",1,"TO",9,"STAGE1",10," "," ","STAGE2",11," "," ","STAGE1",12," "," ","ISOL",13," "," ","STAGE1",14," "," ","ISOL"," "," "," "," "," "," "," "," "," "," "," "," "," "," "," "," "," "," "," "," "," "," "," "," "," "," "," "," "," "," "," "," "]
[null,null,"P11111111121011",1,"TO",9,"STAGE1",10," "," ","STAGE2",11," "," ","STAGE1",12," "," ","ISOL",13,"AND",14,"STAGE1"," "," "," "," "," "," "," "," "," "," "," "," "," "," "," "," "," "," "," "," "," "," "," "," "," "," "," "," "," "," "," "," "," "," "," "," "]
[null,null,"P11111111121012",1,"TO",9,"STAGE1",10," "," ","STAGE2",11," "," ","STAGE1",12," "," ","ISOL",13," "," ","STAGE1",14," "," ","STAGE2"," "," "," "," "," "," "," "," "," "," "," "," "," "," "," "," "," "," "," "," "," "," "," "," "," "," "," "," "," "," "," "," "]
[null,null,"P11111111121013",1,"TO",9,"STAGE1",10," "," ","STAGE2",11," "," ","STAGE1",12," "," ","ISOL",13," "," ","STAGE1",14," "," ","STAGE3"," "," "," "," "," "," "," "," "," "," "," "," "," "," "," "," "," "," "," "," "," "," "," "," "," "," "," "," "," "," "," "," "]
[null,null,"P11111111121014",1,"TO",9,"STAGE1",10," "," ","STAGE2",11," "," ","STAGE1",12," "," ","ISOL",13," "," ","STAGE1",14," "," ","MONIT"," "," "," "," "," "," "," "," "," "," "," "," "," "," "," "," "," "," "," "," "," "," "," "," "," "," "," "," "," "," "," "," "]
[null,null,"P11111111121020",1,"TO",9,"STAGE1",10," "," ","STAGE2",11," "," ","STAGE1",12," "," ","ISOL",13," "," ","STAGE2",14," "," ","ISOL"," "," "," "," "," "," "," "," "," "," "," "," "," "," "," "," "," "," "," "," "," "," "," "," "," "," "," "," "," "," "," "," "]
[null,null,"P11111111121021",1,"TO",9,"STAGE1",10," "," ","STAGE2",11," "," ","STAGE1",12," "," ","ISOL",13," "," ","STAGE2",14," "," ","STAGE1"," "," "," "," "," "," "," "," "," "," "," "," "," "," "," "," "," "," "," "," "," "," "," "," "," "," "," "," "," "," "," "," "]
[null,null,"P11111111121022",1,"TO",9,"STAGE1",10," "," ","STAGE2",11," "," ","STAGE1",12," "," ","ISOL",13,"AND",14,"STAGE2"," "," "," "," "," "," "," "," "," "," "," "," "," "," "," "," "," "," "," "," "," "," "," "," "," "," "," "," "," "," "," "," "," "," "," "," "]
[null,null,"P11111111121023",1,"TO",9,"STAGE1",10," "," ","STAGE2",11," "," ","STAGE1",12," "," ","ISOL",13," "," ","STAGE2",14," "," ","STAGE3"," "," "," "," "," "," "," "," "," "," "," "," "," "," "," "," "," "," "," "," "," "," "," "," "," "," "," "," "," "," "," "," "]
[null,null,"P11111111121024",1,"TO",9,"STAGE1",10," "," ","STAGE2",11," "," ","STAGE1",12," "," ","ISOL",13," "," ","STAGE2",14," "," ","MONIT"," "," "," "," "," "," "," "," "," "," "," "," "," "," "," "," "," "," "," "," "," "," "," "," "," "," "," "," "," "," "," "," "]
[null,null,"P11111111121030",1,"TO",9,"STAGE1",10," "," ","STAGE2",11," "," ","STAGE1",12," "," ","ISOL",13," "," ","STAGE3",14," "," ","ISOL"," "," "," "," "," "," "," "," "," "," "," "," "," "," "," "," "," "," "," "," "," "," "," "," "," "," "," "," "," "," "," "," "]
[null,null,"P11111111121031",1,"TO",9,"STAGE1",10," "," ","STAGE2",11," "," ","STAGE1",12," "," ","ISOL",13," "," ","STAGE3",14," "," ","STAGE1"," "," "," "," "," "," "," "," "," "," "," "," "," "," "," "," "," "," "," "," "," "," "," "," "," "," "," "," "," "," "," "," "]
[null,null,"P11111111121032",1,"TO",9,"STAGE1",10," "," ","STAGE2",11," "," ","STAGE1",12," "," ","ISOL",13," "," ","STAGE3",14," "," ","STAGE2"," "," "," "," "," "," "," "," "," "," "," "," "," "," "," "," "," "," "," "," "," "," "," "," "," "," "," "," "," "," "," "," "]
[null,null,"P11111111121033",1,"TO",9,"STAGE1",10," "," ","STAGE2",11," "," ","STAGE1",12," "," ","ISOL",13,"AND",14,"STAGE3"," "," "," "," "," "," "," "," "," "," "," "," "," "," "," "," "," "," "," "," "," "," "," "," "," "," "," "," "," "," "," "," "," "," "," "," "]
[null,null,"P11111111121034",1,"TO",9,"STAGE1",10," "," ","STAGE2",11," "," ","STAGE1",12," "," ","ISOL",13," "," ","STAGE3",14," "," ","MONIT"," "," "," "," "," "," "," "," "," "," "," "," "," "," "," "," "," "," "," "," "," "," "," "," "," "," "," "," "," "," "," "," "]
[null,null,"P11111111121040",1,"TO",9,"STAGE1",10," "," ","STAGE2",11," "," ","STAGE1",12," "," ","ISOL",13," "," ","MONIT",14," "," ","ISOL"," "," "," "," "," "," "," "," "," "," "," "," "," "," "," "," "," "," "," "," "," "," "," "," "," "," "," "," "," "," "," "," "]
[null,null,"P11111111121041",1,"TO",9,"STAGE1",10," "," ","STAGE2",11," "," ","STAGE1",12," "," ","ISOL",13," "," ","MONIT",14," "," ","STAGE1"," "," "," "," "," "," "," "," "," "," "," "," "," "," "," "," "," "," "," "," "," "," "," "," "," "," "," "," "," "," "," "," "]
[null,null,"P11111111121042",1,"TO",9,"STAGE1",10," "," ","STAGE2",11," "," ","STAGE1",12," "," ","ISOL",13," "," ","MONIT",14," "," ","STAGE2"," "," "," "," "," "," "," "," "," "," "," "," "," "," "," "," "," "," "," "," "," "," "," "," "," "," "," "," "," "," "," "," "]
[null,null,"P11111111121043",1,"TO",9,"STAGE1",10," "," ","STAGE2",11," "," ","STAGE1",12," "," ","ISOL",13," "," ","MONIT",14," "," ","STAGE3"," "," "," "," "," "," "," "," "," "," "," "," "," "," "," "," "," "," "," "," "," "," "," "," "," "," "," "," "," "," "," "," "]
[null,null,"P11111111121044",1,"TO",9,"STAGE1",10," "," ","STAGE2",11," "," ","STAGE1",12," "," ","ISOL",13,"AND",14,"MONIT"," "," "," "," "," "," "," "," "," "," "," "," "," "," "," "," "," "," "," "," "," "," "," "," "," "," "," "," "," "," "," "," "," "," "," "," "]
[null,null,"P11111111121089",1,"TO",9,"STAGE1",10," "," ","STAGE2",11," "," ","STAGE1",12," "," ","ISOL",13,"AND",14,"SHORT"," "," "," "," "," "," "," "," "," "," "," "," "," "," "," "," "," "," "," "," "," "," "," "," "," "," "," "," "," "," "," "," "," "," "," "," "]
[null,null,"P11111111121100",1,"TO",9,"STAGE1",10," "," ","STAGE2",11,"AND",12,"STAGE1",13,"AND",14,"ISOL"," "," "," "," "," "," "," "," "," "," "," "," "," "," "," "," "," "," "," "," "," "," "," "," "," "," "," "," "," "," "," "," "," "," "," "," "," "," "," "," "]
[null,null,"P11111111121101",1,"TO",9,"STAGE1",10," "," ","STAGE2",11,"AND",12,"STAGE1",13," "," ","ISOL",14," "," ","STAGE1"," "," "," "," "," "," "," "," "," "," "," "," "," "," "," "," "," "," "," "," "," "," "," "," "," "," "," "," "," "," "," "," "," "," "," "," "]
[null,null,"P11111111121102",1,"TO",9,"STAGE1",10," "," ","STAGE2",11,"AND",12,"STAGE1",13," "," ","ISOL",14," "," ","STAGE2"," "," "," "," "," "," "," "," "," "," "," "," "," "," "," "," "," "," "," "," "," "," "," "," "," "," "," "," "," "," "," "," "," "," "," "," "]
[null,null,"P11111111121103",1,"TO",9,"STAGE1",10," "," ","STAGE2",11,"AND",12,"STAGE1",13," "," ","ISOL",14," "," ","STAGE3"," "," "," "," "," "," "," "," "," "," "," "," "," "," "," "," "," "," "," "," "," "," "," "," "," "," "," "," "," "," "," "," "," "," "," "," "]
[null,null,"P11111111121104",1,"TO",9,"STAGE1",10," "," ","STAGE2",11,"AND",12,"STAGE1",13," "," ","ISOL",14," "," ","MONIT"," "," "," "," "," "," "," "," "," "," "," "," "," "," "," "," "," "," "," "," "," "," "," "," "," "," "," "," "," "," "," "," "," "," "," "," "]
[null,null,"P11111111121110",1,"TO",9,"STAGE1",10," "," ","STAGE2",11,"TO",13,"STAGE1",14," "," ","ISOL"," "," "," "," "," "," "," "," "," "," "," "," "," "," "," "," "," "," "," "," "," "," "," "," "," "," "," "," "," "," "," "," "," "," "," "," "," "," "," "," "]
[null,null,"P11111111121111",1,"TO",9,"STAGE1",10," "," ","STAGE2",11,"TO",14,"STAGE1"," "," "," "," "," "," "," "," "," "," "," "," "," "," "," "," "," "," "," "," "," "," "," "," "," "," "," "," "," "," "," "," "," "," "," "," "," "," "," "," "," "," "," "," "]
[null,null,"P11111111121112",1,"TO",9,"STAGE1",10," "," ","STAGE2",11,"TO",13,"STAGE1",14," "," ","STAGE2"," "," "," "," "," "," "," "," "," "," "," "," "," "," "," "," "," "," "," "," "," "," "," "," "," "," "," "," "," "," "," "," "," "," "," "," "," "," "," "," "]
[null,null,"P11111111121113",1,"TO",9,"STAGE1",10," "," ","STAGE2",11,"TO",13,"STAGE1",14," "," ","STAGE3"," "," "," "," "," "," "," "," "," "," "," "," "," "," "," "," "," "," "," "," "," "," "," "," "," "," "," "," "," "," "," "," "," "," "," "," "," "," "," "," "]
[null,null,"P11111111121114",1,"TO",9,"STAGE1",10," "," ","STAGE2",11,"TO",13,"STAGE1",14," "," ","MONIT"," "," "," "," "," "," "," "," "," "," "," "," "," "," "," "," "," "," "," "," "," "," "," "," "," "," "," "," "," "," "," "," "," "," "," "," "," "," "," "," "]
[null,null,"P11111111121120",1,"TO",9,"STAGE1",10," "," ","STAGE2",11,"AND",12,"STAGE2",13," "," ","STAGE2",14," "," ","ISOL"," "," "," "," "," "," "," "," "," "," "," "," "," "," "," "," "," "," "," "," "," "," "," "," "," "," "," "," "," "," "," "," "," "," "," "," "]
[null,null,"P11111111121121",1,"TO",9,"STAGE1",10," "," ","STAGE2",11,"AND",12,"STAGE2",13," "," ","STAGE2",14," "," ","STAGE1"," "," "," "," "," "," "," "," "," "," "," "," "," "," "," "," "," "," "," "," "," "," "," "," "," "," "," "," "," "," "," "," "," "," "," "," "]
[null,null,"P11111111121122",1,"TO",9,"STAGE1",10," "," ","STAGE2",11,"AND",12,"STAGE2",13,"AND",14,"STAGE2"," "," "," "," "," "," "," "," "," "," "," "," "," "," "," "," "," "," "," "," "," "," "," "," "," "," "," "," "," "," "," "," "," "," "," "," "," "," "," "," "]
[null,null,"P11111111121123",1,"TO",9,"STAGE1",10," "," ","STAGE2",11,"AND",12,"STAGE2",13," "," ","STAGE2",14," "," ","STAGE3"," "," "," "," "," "," "," "," "," "," "," "," "," "," "," "," "," "," "," "," "," "," "," "," "," "," "," "," "," "," "," "," "," "," "," "," "]
[null,null,"P11111111121124",1,"TO",9,"STAGE1",10," "," ","STAGE2",11,"AND",12,"STAGE2",13," "," ","STAGE2",14," "," ","MONIT"," "," "," "," "," "," "," "," "," "," "," "," "," "," "," "," "," "," "," "," "," "," "," "," "," "," "," "," "," "," "," "," "," "," "," "," "]
[null,null,"P11111111121130",1,"TO",9,"STAGE1",10," "," ","STAGE2",11,"AND",12,"STAGE2",13," "," ","STAGE3",14," "," ","ISOL"," "," "," "," "," "," "," "," "," "," "," "," "," "," "," "," "," "," "," "," "," "," "," "," "," "," "," "," "," "," "," "," "," "," "," "," "]
[null,null,"P11111111121131",1,"TO",9,"STAGE1",10," "," ","STAGE2",11,"AND",12,"STAGE2",13," "," ","STAGE3",14," "," ","STAGE1"," "," "," "," "," "," "," "," "," "," "," "," "," "," "," "," "," "," "," "," "," "," "," "," "," "," "," "," "," "," "," "," "," "," "," "," "]
[null,null,"P11111111121132",1,"TO",9,"STAGE1",10," "," ","STAGE2",11,"AND",12,"STAGE2",13," "," ","STAGE3",14," "," ","STAGE2"," "," "," "," "," "," "," "," "," "," "," "," "," "," "," "," "," "," "," "," "," "," "," "," "," "," "," "," "," "," "," "," "," "," "," "," "]
[null,null,"P11111111121133",1,"TO",9,"STAGE1",10," "," ","STAGE2",11,"AND",12,"STAGE2",13,"AND",14,"STAGE3"," "," "," "," "," "," "," "," "," "," "," "," "," "," "," "," "," "," "," "," "," "," "," "," "," "," "," "," "," "," "," "," "," "," "," "," "," "," "," "," "]
[null,null,"P11111111121134",1,"TO",9,"STAGE1",10," "," ","STAGE2",11,"AND",12,"STAGE2",13," "," ","STAGE3",14," "," ","MONIT"," "," "," "," "," "," "," "," "," "," "," "," "," "," "," "," "," "," "," "," "," "," "," "," "," "," "," "," "," "," "," "," "," "," "," "," "]
[null,null,"P11111111121140",1,"TO",9,"STAGE1",10," "," ","STAGE2",11,"AND",12,"STAGE2",13," "," ","MONIT",14," "," ","ISOL"," "," "," "," "," "," "," "," "," "," "," "," "," "," "," "," "," "," "," "," "," "," "," "," "," "," "," "," "," "," "," "," "," "," "," "," "]
[null,null,"P11111111121141",1,"TO",9,"STAGE1",10," "," ","STAGE2",11,"AND",12,"STAGE2",13," "," ","MONIT",14," "," ","STAGE1"," "," "," "," "," "," "," "," "," "," "," "," "," "," "," "," "," "," "," "," "," "," "," "," "," "," "," "," "," "," "," "," "," "," "," "," "]
[null,null,"P11111111121142",1,"TO",9,"STAGE1",10," "," ","STAGE2",11,"AND",12,"STAGE2",13," "," ","MONIT",14," "," ","STAGE2"," "," "," "," "," "," "," "," "," "," "," "," "," "," "," "," "," "," "," "," "," "," "," "," "," "," "," "," "," "," "," "," "," "," "," "," "]
[null,null,"P11111111121143",1,"TO",9,"STAGE1",10," "," ","STAGE2",11,"AND",12,"STAGE2",13," "," ","MONIT",14," "," ","STAGE3"," "," "," "," "," "," "," "," "," "," "," "," "," "," "," "," "," "," "," "," "," "," "," "," "," "," "," "," "," "," "," "," "," "," "," "," "]
[null,null,"P11111111121144",1,"TO",9,"STAGE1",10," "," ","STAGE2",11,"AND",12,"STAGE2",13,"AND",14,"MONIT"," "," "," "," "," "," "," "," "," "," "," "," "," "," "," "," "," "," "," "," "," "," "," "," "," "," "," "," "," "," "," "," "," "," "," "," "," "," "," "," "]
[null,null,"P11111111121189",1,"TO",9,"STAGE1",10," "," ","STAGE2",11,"AND",12,"STAGE2",13,"AND",14,"SHORT"," "," "," "," "," "," "," "," "," "," "," "," "," "," "," "," "," "," "," "," "," "," "," "," "," "," "," "," "," "," "," "," "," "," "," "," "," "," "," "," "]
[null,null,"P11111111121200",1,"TO",9,"STAGE1",10," "," ","STAGE2",11," "," ","STAGE1",12," "," ","STAGE2",13,"AND",14,"ISOL"," "," "," "," "," "," "," "," "," "," "," "," "," "," "," "," "," "," "," "," "," "," "," "," "," "," "," "," "," "," "," "," "," "," "," "," "]
[null,null,"P11111111121201",1,"TO",9,"STAGE1",10," "," ","STAGE2",11," "," ","STAGE1",12," "," ","STAGE2",13," "," ","ISOL",14," "," ","STAGE1"," "," "," "," "," "," "," "," "," "," "," "," "," "," "," "," "," "," "," "," "," "," "," "," "," "," "," "," "," "," "," "," "]
[null,null,"P11111111121202",1,"TO",9,"STAGE1",10," "," ","STAGE2",11," "," ","STAGE1",12," "," ","STAGE2",13," "," ","ISOL",14," "," ","STAGE2"," "," "," "," "," "," "," "," "," "," "," "," "," "," "," "," "," "," "," "," "," "," "," "," "," "," "," "," "," "," "," "," "]
[null,null,"P11111111121203",1,"TO",9,"STAGE1",10," "," ","STAGE2",11," "," ","STAGE1",12," "," ","STAGE2",13," "," ","ISOL",14," "," ","STAGE3"," "," "," "," "," "," "," "," "," "," "," "," "," "," "," "," "," "," "," "," "," "," "," "," "," "," "," "," "," "," "," "," "]
[null,null,"P11111111121204",1,"TO",9,"STAGE1",10," "," ","STAGE2",11," "," ","STAGE1",12," "," ","STAGE2",13," "," ","ISOL",14," "," ","MONIT"," "," "," "," "," "," "," "," "," "," "," "," "," "," "," "," "," "," "," "," "," "," "," "," "," "," "," "," "," "," "," "," "]
[null,null,"P11111111121210",1,"TO",9,"STAGE1",10," "," ","STAGE2",11," "," ","STAGE1",12," "," ","STAGE2",13," "," ","STAGE1",14," "," ","ISOL"," "," "," "," "," "," "," "," "," "," "," "," "," "," "," "," "," "," "," "," "," "," "," "," "," "," "," "," "," "," "," "," "]
[null,null,"P11111111121211",1,"TO",9,"STAGE1",10," "," ","STAGE2",11," "," ","STAGE1",12," "," ","STAGE2",13,"AND",14,"STAGE1"," "," "," "," "," "," "," "," "," "," "," "," "," "," "," "," "," "," "," "," "," "," "," "," "," "," "," "," "," "," "," "," "," "," "," "," "]
[null,null,"P11111111121212",1,"TO",9,"STAGE1",10," "," ","STAGE2",11," "," ","STAGE1",12," "," ","STAGE2",13," "," ","STAGE1",14," "," ","STAGE2"," "," "," "," "," "," "," "," "," "," "," "," "," "," "," "," "," "," "," "," "," "," "," "," "," "," "," "," "," "," "," "," "]
[null,null,"P11111111121213",1,"TO",9,"STAGE1",10," "," ","STAGE2",11," "," ","STAGE1",12," "," ","STAGE2",13," "," ","STAGE1",14," "," ","STAGE3"," "," "," "," "," "," "," "," "," "," "," "," "," "," "," "," "," "," "," "," "," "," "," "," "," "," "," "," "," "," "," "," "]
[null,null,"P11111111121214",1,"TO",9,"STAGE1",10," "," ","STAGE2",11," "," ","STAGE1",12," "," ","STAGE2",13," "," ","STAGE1",14," "," ","MONIT"," "," "," "," "," "," "," "," "," "," "," "," "," "," "," "," "," "," "," "," "," "," "," "," "," "," "," "," "," "," "," "," "]
[null,null,"P11111111121220",1,"TO",9,"STAGE1",10," "," ","STAGE2",11," "," ","STAGE1",12,"AND",13,"STAGE2",14," "," ","ISOL"," "," "," "," "," "," "," "," "," "," "," "," "," "," "," "," "," "," "," "," "," "," "," "," "," "," "," "," "," "," "," "," "," "," "," "," "]
[null,null,"P11111111121221",1,"TO",9,"STAGE1",10," "," ","STAGE2",11," "," ","STAGE1",12,"AND",13,"STAGE2",14," "," ","STAGE1"," "," "," "," "," "," "," "," "," "," "," "," "," "," "," "," "," "," "," "," "," "," "," "," "," "," "," "," "," "," "," "," "," "," "," "," "]
[null,null,"P11111111121222",1,"TO",9,"STAGE1",10," "," ","STAGE2",11," "," ","STAGE1",12,"TO",14,"STAGE2"," "," "," "," "," "," "," "," "," "," "," "," "," "," "," "," "," "," "," "," "," "," "," "," "," "," "," "," "," "," "," "," "," "," "," "," "," "," "," "," "]
[null,null,"P11111111121223",1,"TO",9,"STAGE1",10," "," ","STAGE2",11," "," ","STAGE1",12,"AND",13,"STAGE2",14," "," ","STAGE3"," "," "," "," "," "," "," "," "," "," "," "," "," "," "," "," "," "," "," "," "," "," "," "," "," "," "," "," "," "," "," "," "," "," "," "," "]
[null,null,"P11111111121224",1,"TO",9,"STAGE1",10," "," ","STAGE2",11," "," ","STAGE1",12,"AND",13,"STAGE2",14," "," ","MONIT"," "," "," "," "," "," "," "," "," "," "," "," "," "," "," "," "," "," "," "," "," "," "," "," "," "," "," "," "," "," "," "," "," "," "," "," "]
[null,null,"P11111111121230",1,"TO",9,"STAGE1",10," "," ","STAGE2",11," "," ","STAGE1",12," "," ","STAGE2",13," "," ","STAGE3",14," "," ","ISOL"," "," "," "," "," "," "," "," "," "," "," "," "," "," "," "," "," "," "," "," "," "," "," "," "," "," "," "," "," "," "," "," "]
[null,null,"P11111111121231",1,"TO",9,"STAGE1",10," "," ","STAGE2",11," "," ","STAGE1",12," "," ","STAGE2",13," "," ","STAGE3",14," "," ","STAGE1"," "," "," "," "," "," "," "," "," "," "," "," "," "," "," "," "," "," "," "," "," "," "," "," "," "," "," "," "," "," "," "," "]
[null,null,"P11111111121232",1,"TO",9,"STAGE1",10," "," ","STAGE2",11," "," ","STAGE1",12," "," ","STAGE2",13," "," ","STAGE3",14," "," ","STAGE2"," "," "," "," "," "," "," "," "," "," "," "," "," "," "," "," "," "," "," "," "," "," "," "," "," "," "," "," "," "," "," "," "]
[null,null,"P11111111121233",1,"TO",9,"STAGE1",10," "," ","STAGE2",11," "," ","STAGE1",12," "," ","STAGE2",13,"AND",14,"STAGE3"," "," "," "," "," "," "," "," "," "," "," "," "," "," "," "," "," "," "," "," "," "," "," "," "," "," "," "," "," "," "," "," "," "," "," "," "]
[null,null,"P11111111121234",1,"TO",9,"STAGE1",10," "," ","STAGE2",11," "," ","STAGE1",12," "," ","STAGE2",13," "," ","STAGE3",14," "," ","MONIT"," "," "," "," "," "," "," "," "," "," "," "," "," "," "," "," "," "," "," "," "," "," "," "," "," "," "," "," "," "," "," "," "]
[null,null,"P11111111121240",1,"TO",9,"STAGE1",10," "," ","STAGE2",11," "," ","STAGE1",12," "," ","STAGE2",13," "," ","MONIT",14," "," ","ISOL"," "," "," "," "," "," "," "," "," "," "," "," "," "," "," "," "," "," "," "," "," "," "," "," "," "," "," "," "," "," "," "," "]
[null,null,"P11111111121241",1,"TO",9,"STAGE1",10," "," ","STAGE2",11," "," ","STAGE1",12," "," ","STAGE2",13," "," ","MONIT",14," "," ","STAGE1"," "," "," "," "," "," "," "," "," "," "," "," "," "," "," "," "," "," "," "," "," "," "," "," "," "," "," "," "," "," "," "," "]
[null,null,"P11111111121242",1,"TO",9,"STAGE1",10," "," ","STAGE2",11," "," ","STAGE1",12," "," ","STAGE2",13," "," ","MONIT",14," "," ","STAGE2"," "," "," "," "," "," "," "," "," "," "," "," "," "," "," "," "," "," "," "," "," "," "," "," "," "," "," "," "," "," "," "," "]
[null,null,"P11111111121243",1,"TO",9,"STAGE1",10," "," ","STAGE2",11," "," ","STAGE1",12," "," ","STAGE2",13," "," ","MONIT",14," "," ","STAGE3"," "," "," "," "," "," "," "," "," "," "," "," "," "," "," "," "," "," "," "," "," "," "," "," "," "," "," "," "," "," "," "," "]
[null,null,"P11111111121244",1,"TO",9,"STAGE1",10," "," ","STAGE2",11," "," ","STAGE1",12," "," ","STAGE2",13,"AND",14,"MONIT"," "," "," "," "," "," "," "," "," "," "," "," "," "," "," "," "," "," "," "," "," "," "," "," "," "," "," "," "," "," "," "," "," "," "," "," "]
[null,null,"P11111111121289",1,"TO",9,"STAGE1",10," "," ","STAGE2",11," "," ","STAGE1",12," "," ","STAGE2",13,"AND",14,"SHORT"," "," "," "," "," "," "," "," "," "," "," "," "," "," "," "," "," "," "," "," "," "," "," "," "," "," "," "," "," "," "," "," "," "," "," "," "]
[null,null,"P11111111121300",1,"TO",9,"STAGE1",10," "," ","STAGE2",11," "," ","STAGE1",12," "," ","STAGE3",13,"AND",14,"ISOL"," "," "," "," "," "," "," "," "," "," "," "," "," "," "," "," "," "," "," "," "," "," "," "," "," "," "," "," "," "," "," "," "," "," "," "," "]
[null,null,"P11111111121301",1,"TO",9,"STAGE1",10," "," ","STAGE2",11," "," ","STAGE1",12," "," ","STAGE3",13," "," ","ISOL",14," "," ","STAGE1"," "," "," "," "," "," "," "," "," "," "," "," "," "," "," "," "," "," "," "," "," "," "," "," "," "," "," "," "," "," "," "," "]
[null,null,"P11111111121302",1,"TO",9,"STAGE1",10," "," ","STAGE2",11," "," ","STAGE1",12," "," ","STAGE3",13," "," ","ISOL",14," "," ","STAGE2"," "," "," "," "," "," "," "," "," "," "," "," "," "," "," "," "," "," "," "," "," "," "," "," "," "," "," "," "," "," "," "," "]
[null,null,"P11111111121303",1,"TO",9,"STAGE1",10," "," ","STAGE2",11," "," ","STAGE1",12," "," ","STAGE3",13," "," ","ISOL",14," "," ","STAGE3"," "," "," "," "," "," "," "," "," "," "," "," "," "," "," "," "," "," "," "," "," "," "," "," "," "," "," "," "," "," "," "," "]
[null,null,"P11111111121304",1,"TO",9,"STAGE1",10," "," ","STAGE2",11," "," ","STAGE1",12," "," ","STAGE3",13," "," ","ISOL",14," "," ","MONIT"," "," "," "," "," "," "," "," "," "," "," "," "," "," "," "," "," "," "," "," "," "," "," "," "," "," "," "," "," "," "," "," "]
[null,null,"P11111111121310",1,"TO",9,"STAGE1",10," "," ","STAGE2",11," "," ","STAGE1",12," "," ","STAGE3",13," "," ","STAGE1",14," "," ","ISOL"," "," "," "," "," "," "," "," "," "," "," "," "," "," "," "," "," "," "," "," "," "," "," "," "," "," "," "," "," "," "," "," "]
[null,null,"P11111111121311",1,"TO",9,"STAGE1",10," "," ","STAGE2",11," "," ","STAGE1",12," "," ","STAGE3",13,"AND",14,"STAGE1"," "," "," "," "," "," "," "," "," "," "," "," "," "," "," "," "," "," "," "," "," "," "," "," "," "," "," "," "," "," "," "," "," "," "," "," "]
[null,null,"P11111111121312",1,"TO",9,"STAGE1",10," "," ","STAGE2",11," "," ","STAGE1",12," "," ","STAGE3",13," "," ","STAGE1",14," "," ","STAGE2"," "," "," "," "," "," "," "," "," "," "," "," "," "," "," "," "," "," "," "," "," "," "," "," "," "," "," "," "," "," "," "," "]
[null,null,"P11111111121313",1,"TO",9,"STAGE1",10," "," ","STAGE2",11," "," ","STAGE1",12," "," ","STAGE3",13," "," ","STAGE1",14," "," ","STAGE3"," "," "," "," "," "," "," "," "," "," "," "," "," "," "," "," "," "," "," "," "," "," "," "," "," "," "," "," "," "," "," "," "]
[null,null,"P11111111121314",1,"TO",9,"STAGE1",10," "," ","STAGE2",11," "," ","STAGE1",12," "," ","STAGE3",13," "," ","STAGE1",14," "," ","MONIT"," "," "," "," "," "," "," "," "," "," "," "," "," "," "," "," "," "," "," "," "," "," "," "," "," "," "," "," "," "," "," "," "]
[null,null,"P11111111121320",1,"TO",9,"STAGE1",10," "," ","STAGE2",11," "," ","STAGE1",12," "," ","STAGE3",13," "," ","STAGE2",14," "," ","ISOL"," "," "," "," "," "," "," "," "," "," "," "," "," "," "," "," "," "," "," "," "," "," "," "," "," "," "," "," "," "," "," "," "]
[null,null,"P11111111121321",1,"TO",9,"STAGE1",10," "," ","STAGE2",11," "," ","STAGE1",12," "," ","STAGE3",13," "," ","STAGE2",14," "," ","STAGE1"," "," "," "," "," "," "," "," "," "," "," "," "," "," "," "," "," "," "," "," "," "," "," "," "," "," "," "," "," "," "," "," "]
[null,null,"P11111111121322",1,"TO",9,"STAGE1",10," "," ","STAGE2",11," "," ","STAGE1",12," "," ","STAGE3",13,"AND",14,"STAGE2"," "," "," "," "," "," "," "," "," "," "," "," "," "," "," "," "," "," "," "," "," "," "," "," "," "," "," "," "," "," "," "," "," "," "," "," "]
[null,null,"P11111111121323",1,"TO",9,"STAGE1",10," "," ","STAGE2",11," "," ","STAGE1",12," "," ","STAGE3",13," "," ","STAGE2",14," "," ","STAGE3"," "," "," "," "," "," "," "," "," "," "," "," "," "," "," "," "," "," "," "," "," "," "," "," "," "," "," "," "," "," "," "," "]
[null,null,"P11111111121324",1,"TO",9,"STAGE1",10," "," ","STAGE2",11," "," ","STAGE1",12," "," ","STAGE3",13," "," ","STAGE2",14," "," ","MONIT"," "," "," "," "," "," "," "," "," "," "," "," "," "," "," "," "," "," "," "," "," "," "," "," "," "," "," "," "," "," "," "," "]
[null,null,"P11111111121330",1,"TO",9,"STAGE1",10," "," ","STAGE2",11," "," ","STAGE1",12,"AND",13,"STAGE3",14," "," ","ISOL"," "," "," "," "," "," "," "," "," "," "," "," "," "," "," "," "," "," "," "," "," "," "," "," "," "," "," "," "," "," "," "," "," "," "," "," "]
[null,null,"P11111111121331",1,"TO",9,"STAGE1",10," "," ","STAGE2",11," "," ","STAGE1",12,"AND",13,"STAGE3",14," "," ","STAGE1"," "," "," "," "," "," "," "," "," "," "," "," "," "," "," "," "," "," "," "," "," "," "," "," "," "," "," "," "," "," "," "," "," "," "," "," "]
[null,null,"P11111111121332",1,"TO",9,"STAGE1",10," "," ","STAGE2",11," "," ","STAGE1",12,"AND",13,"STAGE3",14," "," ","STAGE2"," "," "," "," "," "," "," "," "," "," "," "," "," "," "," "," "," "," "," "," "," "," "," "," "," "," "," "," "," "," "," "," "," "," "," "," "]
[null,null,"P11111111121333",1,"TO",9,"STAGE1",10," "," ","STAGE2",11," "," ","STAGE1",12,"TO",14,"STAGE3"," "," "," "," "," "," "," "," "," "," "," "," "," "," "," "," "," "," "," "," "," "," "," "," "," "," "," "," "," "," "," "," "," "," "," "," "," "," "," "," "]
[null,null,"P11111111121334",1,"TO",9,"STAGE1",10," "," ","STAGE2",11," "," ","STAGE1",12,"AND",13,"STAGE3",14," "," ","MONIT"," "," "," "," "," "," "," "," "," "," "," "," "," "," "," "," "," "," "," "," "," "," "," "," "," "," "," "," "," "," "," "," "," "," "," "," "]
[null,null,"P11111111121340",1,"TO",9,"STAGE1",10," "," ","STAGE2",11," "," ","STAGE1",12," "," ","STAGE3",13," "," ","MONIT",14," "," ","ISOL"," "," "," "," "," "," "," "," "," "," "," "," "," "," "," "," "," "," "," "," "," "," "," "," "," "," "," "," "," "," "," "," "]
[null,null,"P11111111121341",1,"TO",9,"STAGE1",10," "," ","STAGE2",11," "," ","STAGE1",12," "," ","STAGE3",13," "," ","MONIT",14," "," ","STAGE1"," "," "," "," "," "," "," "," "," "," "," "," "," "," "," "," "," "," "," "," "," "," "," "," "," "," "," "," "," "," "," "," "]
[null,null,"P11111111121342",1,"TO",9,"STAGE1",10," "," ","STAGE2",11," "," ","STAGE1",12," "," ","STAGE3",13," "," ","MONIT",14," "," ","STAGE2"," "," "," "," "," "," "," "," "," "," "," "," "," "," "," "," "," "," "," "," "," "," "," "," "," "," "," "," "," "," "," "," "]
[null,null,"P11111111121343",1,"TO",9,"STAGE1",10," "," ","STAGE2",11," "," ","STAGE1",12," "," ","STAGE3",13," "," ","MONIT",14," "," ","STAGE3"," "," "," "," "," "," "," "," "," "," "," "," "," "," "," "," "," "," "," "," "," "," "," "," "," "," "," "," "," "," "," "," "]
[null,null,"P11111111121344",1,"TO",9,"STAGE1",10," "," ","STAGE2",11," "," ","STAGE1",12," "," ","STAGE3",13,"AND",14,"MONIT"," "," "," "," "," "," "," "," "," "," "," "," "," "," "," "," "," "," "," "," "," "," "," "," "," "," "," "," "," "," "," "," "," "," "," "," "]
[null,null,"P11111111121389",1,"TO",9,"STAGE1",10," "," ","STAGE2",11," "," ","STAGE1",12," "," ","STAGE3",13,"AND",14,"SHORT"," "," "," "," "," "," "," "," "," "," "," "," "," "," "," "," "," "," "," "," "," "," "," "," "," "," "," "," "," "," "," "," "," "," "," "," "]
[null,null,"P11111111121400",1,"TO",9,"STAGE1",10," "," ","STAGE2",11," "," ","STAGE1",12," "," ","MONIT",13,"AND",14,"ISOL"," "," "," "," "," "," "," "," "," "," "," "," "," "," "," "," "," "," "," "," "," "," "," "," "," "," "," "," "," "," "," "," "," "," "," "," "]
[null,null,"P11111111121401",1,"TO",9,"STAGE1",10," "," ","STAGE2",11," "," ","STAGE1",12," "," ","MONIT",13," "," ","ISOL",14," "," ","STAGE1"," "," "," "," "," "," "," "," "," "," "," "," "," "," "," "," "," "," "," "," "," "," "," "," "," "," "," "," "," "," "," "," "]
[null,null,"P11111111121402",1,"TO",9,"STAGE1",10," "," ","STAGE2",11," "," ","STAGE1",12," "," ","MONIT",13," "," ","ISOL",14," "," ","STAGE2"," "," "," "," "," "," "," "," "," "," "," "," "," "," "," "," "," "," "," "," "," "," "," "," "," "," "," "," "," "," "," "," "]
[null,null,"P11111111121403",1,"TO",9,"STAGE1",10," "," ","STAGE2",11," "," ","STAGE1",12," "," ","MONIT",13," "," ","ISOL",14," "," ","STAGE3"," "," "," "," "," "," "," "," "," "," "," "," "," "," "," "," "," "," "," "," "," "," "," "," "," "," "," "," "," "," "," "," "]
[null,null,"P11111111121404",1,"TO",9,"STAGE1",10," "," ","STAGE2",11," "," ","STAGE1",12," "," ","MONIT",13," "," ","ISOL",14," "," ","MONIT"," "," "," "," "," "," "," "," "," "," "," "," "," "," "," "," "," "," "," "," "," "," "," "," "," "," "," "," "," "," "," "," "]
[null,null,"P11111111121410",1,"TO",9,"STAGE1",10," "," ","STAGE2",11," "," ","STAGE1",12," "," ","MONIT",13," "," ","STAGE1",14," "," ","ISOL"," "," "," "," "," "," "," "," "," "," "," "," "," "," "," "," "," "," "," "," "," "," "," "," "," "," "," "," "," "," "," "," "]
[null,null,"P11111111121411",1,"TO",9,"STAGE1",10," "," ","STAGE2",11," "," ","STAGE1",12," "," ","MONIT",13,"AND",14,"STAGE1"," "," "," "," "," "," "," "," "," "," "," "," "," "," "," "," "," "," "," "," "," "," "," "," "," "," "," "," "," "," "," "," "," "," "," "," "]
[null,null,"P11111111121412",1,"TO",9,"STAGE1",10," "," ","STAGE2",11," "," ","STAGE1",12," "," ","MONIT",13," "," ","STAGE1",14," "," ","STAGE2"," "," "," "," "," "," "," "," "," "," "," "," "," "," "," "," "," "," "," "," "," "," "," "," "," "," "," "," "," "," "," "," "]
[null,null,"P11111111121413",1,"TO",9,"STAGE1",10," "," ","STAGE2",11," "," ","STAGE1",12," "," ","MONIT",13," "," ","STAGE1",14," "," ","STAGE3"," "," "," "," "," "," "," "," "," "," "," "," "," "," "," "," "," "," "," "," "," "," "," "," "," "," "," "," "," "," "," "," "]
[null,null,"P11111111121414",1,"TO",9,"STAGE1",10," "," ","STAGE2",11," "," ","STAGE1",12," "," ","MONIT",13," "," ","STAGE1",14," "," ","MONIT"," "," "," "," "," "," "," "," "," "," "," "," "," "," "," "," "," "," "," "," "," "," "," "," "," "," "," "," "," "," "," "," "]
[null,null,"P11111111121420",1,"TO",9,"STAGE1",10," "," ","STAGE2",11," "," ","STAGE1",12," "," ","MONIT",13," "," ","STAGE2",14," "," ","ISOL"," "," "," "," "," "," "," "," "," "," "," "," "," "," "," "," "," "," "," "," "," "," "," "," "," "," "," "," "," "," "," "," "]
[null,null,"P11111111121421",1,"TO",9,"STAGE1",10," "," ","STAGE2",11," "," ","STAGE1",12," "," ","MONIT",13," "," ","STAGE2",14," "," ","STAGE1"," "," "," "," "," "," "," "," "," "," "," "," "," "," "," "," "," "," "," "," "," "," "," "," "," "," "," "," "," "," "," "," "]
[null,null,"P11111111121422",1,"TO",9,"STAGE1",10," "," ","STAGE2",11," "," ","STAGE1",12," "," ","MONIT",13,"AND",14,"STAGE2"," "," "," "," "," "," "," "," "," "," "," "," "," "," "," "," "," "," "," "," "," "," "," "," "," "," "," "," "," "," "," "," "," "," "," "," "]
[null,null,"P11111111121423",1,"TO",9,"STAGE1",10," "," ","STAGE2",11," "," ","STAGE1",12," "," ","MONIT",13," "," ","STAGE2",14," "," ","STAGE3"," "," "," "," "," "," "," "," "," "," "," "," "," "," "," "," "," "," "," "," "," "," "," "," "," "," "," "," "," "," "," "," "]
[null,null,"P11111111121424",1,"TO",9,"STAGE1",10," "," ","STAGE2",11," "," ","STAGE1",12," "," ","MONIT",13," "," ","STAGE2",14," "," ","MONIT"," "," "," "," "," "," "," "," "," "," "," "," "," "," "," "," "," "," "," "," "," "," "," "," "," "," "," "," "," "," "," "," "]
[null,null,"P11111111121430",1,"TO",9,"STAGE1",10," "," ","STAGE2",11," "," ","STAGE1",12," "," ","MONIT",13," "," ","STAGE3",14," "," ","ISOL"," "," "," "," "," "," "," "," "," "," "," "," "," "," "," "," "," "," "," "," "," "," "," "," "," "," "," "," "," "," "," "," "]
[null,null,"P11111111121431",1,"TO",9,"STAGE1",10," "," ","STAGE2",11," "," ","STAGE1",12," "," ","MONIT",13," "," ","STAGE3",14," "," ","STAGE1"," "," "," "," "," "," "," "," "," "," "," "," "," "," "," "," "," "," "," "," "," "," "," "," "," "," "," "," "," "," "," "," "]
[null,null,"P11111111121432",1,"TO",9,"STAGE1",10," "," ","STAGE2",11," "," ","STAGE1",12," "," ","MONIT",13," "," ","STAGE3",14," "," ","STAGE2"," "," "," "," "," "," "," "," "," "," "," "," "," "," "," "," "," "," "," "," "," "," "," "," "," "," "," "," "," "," "," "," "]
[null,null,"P11111111121433",1,"TO",9,"STAGE1",10," "," ","STAGE2",11," "," ","STAGE1",12," "," ","MONIT",13,"AND",14,"STAGE3"," "," "," "," "," "," "," "," "," "," "," "," "," "," "," "," "," "," "," "," "," "," "," "," "," "," "," "," "," "," "," "," "," "," "," "," "]
[null,null,"P11111111121434",1,"TO",9,"STAGE1",10," "," ","STAGE2",11," "," ","STAGE1",12," "," ","MONIT",13," "," ","STAGE3",14," "," ","MONIT"," "," "," "," "," "," "," "," "," "," "," "," "," "," "," "," "," "," "," "," "," "," "," "," "," "," "," "," "," "," "," "," "]
[null,null,"P11111111121440",1,"TO",9,"STAGE1",10," "," ","STAGE2",11," "," ","STAGE1",12,"AND",13,"MONIT",14," "," ","ISOL"," "," "," "," "," "," "," "," "," "," "," "," "," "," "," "," "," "," "," "," "," "," "," "," "," "," "," "," "," "," "," "," "," "," "," "," "]
[null,null,"P11111111121441",1,"TO",9,"STAGE1",10," "," ","STAGE2",11," "," ","STAGE1",12,"AND",13,"MONIT",14," "," ","STAGE1"," "," "," "," "," "," "," "," "," "," "," "," "," "," "," "," "," "," "," "," "," "," "," "," "," "," "," "," "," "," "," "," "," "," "," "," "]
[null,null,"P11111111121442",1,"TO",9,"STAGE1",10," "," ","STAGE2",11," "," ","STAGE1",12,"AND",13,"MONIT",14," "," ","STAGE2"," "," "," "," "," "," "," "," "," "," "," "," "," "," "," "," "," "," "," "," "," "," "," "," "," "," "," "," "," "," "," "," "," "," "," "," "]
[null,null,"P11111111121443",1,"TO",9,"STAGE1",10," "," ","STAGE2",11," "," ","STAGE1",12,"AND",13,"MONIT",14," "," ","STAGE3"," "," "," "," "," "," "," "," "," "," "," "," "," "," "," "," "," "," "," "," "," "," "," "," "," "," "," "," "," "," "," "," "," "," "," "," "]
[null,null,"P11111111121444",1,"TO",9,"STAGE1",10," "," ","STAGE2",11," "," ","STAGE1",12,"TO",14,"MONIT"," "," "," "," "," "," "," "," "," "," "," "," "," "," "," "," "," "," "," "," "," "," "," "," "," "," "," "," "," "," "," "," "," "," "," "," "," "," "," "," "]
[null,null,"P11111111121489",1,"TO",9,"STAGE1",10," "," ","STAGE2",11," "," ","STAGE1",12," "," ","MONIT",13,"AND",14,"SHORT"," "," "," "," "," "," "," "," "," "," "," "," "," "," "," "," "," "," "," "," "," "," "," "," "," "," "," "," "," "," "," "," "," "," "," "," "]
[null,null,"P11111111122000",1,"TO",9,"STAGE1",10,"AND",11,"STAGE2",12,"TO",14,"ISOL"," "," "," "," "," "," "," "," "," "," "," "," "," "," "," "," "," "," "," "," "," "," "," "," "," "," "," "," "," "," "," "," "," "," "," "," "," "," "," "," "," "," "," "," "]
[null,null,"P11111111122001",1,"TO",9,"STAGE1",10,"AND",11,"STAGE2",12,"AND",13,"ISOL",14," "," ","STAGE1"," "," "," "," "," "," "," "," "," "," "," "," "," "," "," "," "," "," "," "," "," "," "," "," "," "," "," "," "," "," "," "," "," "," "," "," "," "," "," "," "]
[null,null,"P11111111122002",1,"TO",9,"STAGE1",10,"AND",11,"STAGE2",12,"AND",13,"ISOL",14," "," ","STAGE2"," "," "," "," "," "," "," "," "," "," "," "," "," "," "," "," "," "," "," "," "," "," "," "," "," "," "," "," "," "," "," "," "," "," "," "," "," "," "," "," "]
[null,null,"P11111111122003",1,"TO",9,"STAGE1",10,"AND",11,"STAGE2",12,"AND",13,"ISOL",14," "," ","STAGE3"," "," "," "," "," "," "," "," "," "," "," "," "," "," "," "," "," "," "," "," "," "," "," "," "," "," "," "," "," "," "," "," "," "," "," "," "," "," "," "," "]
[null,null,"P11111111122004",1,"TO",9,"STAGE1",10,"AND",11,"STAGE2",12,"AND",13,"ISOL",14," "," ","MONIT"," "," "," "," "," "," "," "," "," "," "," "," "," "," "," "," "," "," "," "," "," "," "," "," "," "," "," "," "," "," "," "," "," "," "," "," "," "," "," "," "]
[null,null,"P11118904888922",1,"TO",4,"STAGE1",5,"AND",6,"SHORT",7,"ISOL"," "," ",8,"MONIT"," "," ",9,"TO",12,"SHORT",13,"AND",14,"STAGE2"," "," "," "," "," "," "," "," "," "," "," "," "," "," "," "," "," "," "," "," "," "," "," "," "," "," "," "," "," "," "," "," "]
[null,null,"P22221133118889",1,"TO",4,"STAGE2",5,"AND",6,"STAGE1",7,"AND",8,"STAGE3",9,"AND",10,"STAGE1",11,"TO",14,"SHORT"," "," "," "," "," "," "," "," "," "," "," "," "," "," "," "," "," "," "," "," "," "," "," "," "," "," "," "," "," "," "," "," "," "," "," "," "]
[null,null,"P22223311228889",1,"TO",4,"STAGE2",5,"AND",6,"STAGE3",7,"AND",8,"STAGE1",9,"AND",10,"STAGE2",11,"TO",14,"SHORT"," "," "," "," "," "," "," "," "," "," "," "," "," "," "," "," "," "," "," "," "," "," "," "," "," "," "," "," "," "," "," "," "," "," "," "," "]
[null,null,"P33111111008889",1,"AND",2,"STAGE3",3,"TO",8,"STAGE1",9,"AND",10,"ISOL",11,"TO",14,"SHORT"," "," "," "," "," "," "," "," "," "," "," "," "," "," "," "," "," "," "," "," "," "," "," "," "," "," "," "," "," "," "," "," "," "," "," "," "," "," "," "," "]
[null,null,"P88888888888889",1,"TO",14,"SHORT"," "," "," "," "," "," "," "," "," "," "," "," "," "," "," "," "," "," "," "," "," "," "," "," "," "," "," "," "," "," "," "," "," "," "," "," "," "," "," "," "," "," "," "," "," "," "," "," "," "," "," "," "]
[null,null,"P88888888888890",1,"TO",13,"SHORT",14," "," ","ISOL"," "," "," "," "," "," "," "," "," "," "," "," "," "," "," "," "," "," "," "," "," "," "," "," "," "," "," "," "," "," "," "," "," "," "," "," "," "," "," "," "," "," "," "," "," "," "," "," "]
[null,null,"P88888888888891",1,"TO",13,"SHORT",14," "," ","STAGE1"," "," "," "," "," "," "," "," "," "," "," "," "," "," "," "," "," "," "," "," "," "," "," "," "," "," "," "," "," "," "," "," "," "," "," "," "," "," "," "," "," "," "," "," "," "," "," "," "]
[null,null,"P88888888888892",1,"TO",13,"SHORT",14," "," ","STAGE2"," "," "," "," "," "," "," "," "," "," "," "," "," "," "," "," "," "," "," "," "," "," "," "," "," "," "," "," "," "," "," "," "," "," "," "," "," "," "," "," "," "," "," "," "," "," "," "," "]
[null,null,"P88888888888893",1,"TO",13,"SHORT",14," "," ","STAGE3"," "," "," "," "," "," "," "," "," "," "," "," "," "," "," "," "," "," "," "," "," "," "," "," "," "," "," "," "," "," "," "," "," "," "," "," "," "," "," "," "," "," "," "," "," "," "," "," "]
[null,null,"P88888888888894",1,"TO",13,"SHORT",14," "," ","MONIT"," "," "," "," "," "," "," "," "," "," "," "," "," "," "," "," "," "," "," "," "," "," "," "," "," "," "," "," "," "," "," "," "," "," "," "," "," "," "," "," "," "," "," "," "," "," "," "," "]
[null,null,"P88888888888901",1,"TO",12,"SHORT",13," "," ","ISOL",14," "," ","STAGE1"," "," "," "," "," "," "," "," "," "," "," "," "," "," "," "," "," "," "," "," "," "," "," "," "," "," "," "," "," "," "," "," "," "," "," "," "," "," "," "," "," "," "," "," "]
[null,null,"P88888888888902",1,"TO",12,"SHORT",13," "," ","ISOL",14," "," ","STAGE2"," "," "," "," "," "," "," "," "," "," "," "," "," "," "," "," "," "," "," "," "," "," "," "," "," "," "," "," "," "," "," "," "," "," "," "," "," "," "," "," "," "," "," "," "]
[null,null,"P88888888888903",1,"TO",12,"SHORT",13," "," ","ISOL",14," "," ","STAGE3"," "," "," "," "," "," "," "," "," "," "," "," "," "," "," "," "," "," "," "," "," "," "," "," "," "," "," "," "," "," "," "," "," "," "," "," "," "," "," "," "," "," "," "," "]
[null,null,"P88888888888904",1,"TO",12,"SHORT",13," "," ","ISOL",14," "," ","MONIT"," "," "," "," "," "," "," "," "," "," "," "," "," "," "," "," "," "," "," "," "," "," "," "," "," "," "," "," "," "," "," "," "," "," "," "," "," "," "," "," "," "," "," "," "]
[null,null,"P88888888888905",1,"TO",12,"SHORT",13,"AND",14,"ISOL"," "," "," "," "," "," "," "," "," "," "," "," "," "," "," "," "," "," "," "," "," "," "," "," "," "," "," "," "," "," "," "," "," "," "," "," "," "," "," "," "," "," "," "," "," "," "," "," "]
[null,null,"P88888888888910",1,"TO",12,"SHORT",13," "," ","STAGE1",14," "," ","ISOL"," "," "," "," "," "," "," "," "," "," "," "," "," "," "," "," "," "," "," "," "," "," "," "," "," "," "," "," "," "," "," "," "," "," "," "," "," "," "," "," "," "," "," "," "]
[null,null,"P88888888888911",1,"TO",12,"SHORT",13,"AND",14,"STAGE1"," "," "," "," "," "," "," "," "," "," "," "," "," "," "," "," "," "," "," "," "," "," "," "," "," "," "," "," "," "," "," "," "," "," "," "," "," "," "," "," "," "," "," "," "," "," "," "," "]
[null,null,"P88888888888912",1,"TO",12,"SHORT",13," "," ","STAGE1",14," "," ","STAGE2"," "," "," "," "," "," "," "," "," "," "," "," "," "," "," "," "," "," "," "," "," "," "," "," "," "," "," "," "," "," "," "," "," "," "," "," "," "," "," "," "," "," "," "," "]
[null,null,"P88888888888913",1,"TO",12,"SHORT",13," "," ","STAGE1",14," "," ","STAGE3"," "," "," "," "," "," "," "," "," "," "," "," "," "," "," "," "," "," "," "," "," "," "," "," "," "," "," "," "," "," "," "," "," "," "," "," "," "," "," "," "," "," "," "," "]
[null,null,"P88888888888914",1,"TO",12,"SHORT",13," "," ","STAGE1",14," "," ","MONIT"," "," "," "," "," "," "," "," "," "," "," "," "," "," "," "," "," "," "," "," "," "," "," "," "," "," "," "," "," "," "," "," "," "," "," "," "," "," "," "," "," "," "," "," "]
[null,null,"P88888888888920",1,"TO",12,"SHORT",13," "," ","STAGE2",14," "," ","ISOL"," "," "," "," "," "," "," "," "," "," "," "," "," "," "," "," "," "," "," "," "," "," "," "," "," "," "," "," "," "," "," "," "," "," "," "," "," "," "," "," "," "," "," "," "]
[null,null,"P88888888888921",1,"TO",12,"SHORT",13," "," ","STAGE2",14," "," ","STAGE2"," "," "," "," "," "," "," "," "," "," "," "," "," "," "," "," "," "," "," "," "," "," "," "," "," "," "," "," "," "," "," "," "," "," "," "," "," "," "," "," "," "," "," "," "]
[null,null,"P88888888888922",1,"TO",12,"SHORT",13,"AND",14,"STAGE2"," "," "," "," "," "," "," "," "," "," "," "," "," "," "," "," "," "," "," "," "," "," "," "," "," "," "," "," "," "," "," "," "," "," "," "," "," "," "," "," "," "," "," "," "," "," "," "," "]
[null,null,"P88888888888923",1,"TO",12,"SHORT",13," "," ","STAGE2",14," "," ","STAGE3"," "," "," "," "," "," "," "," "," "," "," "," "," "," "," "," "," "," "," "," "," "," "," "," "," "," "," "," "," "," "," "," "," "," "," "," "," "," "," "," "," "," "," "," "]
[null,null,"P88888888888924",1,"TO",12,"SHORT",13," "," ","STAGE2",14," "," ","MONIT"," "," "," "," "," "," "," "," "," "," "," "," "," "," "," "," "," "," "," "," "," "," "," "," "," "," "," "," "," "," "," "," "," "," "," "," "," "," "," "," "," "," "," "," "]
[null,null,"P88888888888931",1,"TO",12,"SHORT",13," "," ","STAGE3",14," "," ","STAGE1"," "," "," "," "," "," "," "," "," "," "," "," "," "," "," "," "," "," "," "," "," "," "," "," "," "," "," "," "," "," "," "," "," "," "," "," "," "," "," "," "," "," "," "," "]
[null,null,"P88888888888932",1,"TO",12,"SHORT",13," "," ","STAGE3",14," "," ","STAGE2"," "," "," "," "," "," "," "," "," "," "," "," "," "," "," "," "," "," "," "," "," "," "," "," "," "," "," "," "," "," "," "," "," "," "," "," "," "," "," "," "," "," "," "," "]
[null,null,"P88888888888933",1,"TO",12,"SHORT",13,"AND",14,"STAGE3"," "," "," ","STAGE2"," "," "," "," "," "," "," "," "," "," "," "," "," "," "," "," "," "," "," "," "," "," "," "," "," "," "," "," "," "," "," "," "," "," "," "," "," "," "," "," "," "," "," "," "]
[null,null,"P88888888888934",1,"TO",12,"SHORT",13," "," ","STAGE3",14," "," ","MONIT"," "," "," "," "," "," "," "," "," "," "," "," "," "," "," "," "," "," "," "," "," "," "," "," "," "," "," "," "," "," "," "," "," "," "," "," "," "," "," "," "," "," "," "," "]
[null,null,"P88888888888934",1,"TO",12,"SHORT",13," "," ","STAGE3",14," "," ","ISOL"," "," "," "," "," "," "," "," "," "," "," "," "," "," "," "," "," "," "," "," "," "," "," "," "," "," "," "," "," "," "," "," "," "," "," "," "," "," "," "," "," "," "," "," "]
[null,null,"P88888888888941",1,"TO",12,"SHORT",13," "," ","MONIT",14," "," ","STAGE1"," "," "," "," "," "," "," "," "," "," "," "," "," "," "," "," "," "," "," "," "," "," "," "," "," "," "," "," "," "," "," "," "," "," "," "," "," "," "," "," "," "," "," "," "]
[null,null,"P88888888888942",1,"TO",12,"SHORT",13," "," ","MONIT",14," "," ","STAGE2"," "," "," "," "," "," "," "," "," "," "," "," "," "," "," "," "," "," "," "," "," "," "," "," "," "," "," "," "," "," "," "," "," "," "," "," "," "," "," "," "," "," "," "," "]
[null,null,"P88888888888943",1,"TO",12,"SHORT",13," "," ","MONIT",14," "," ","STAGE3"," "," "," "," "," "," "," "," "," "," "," "," "," "," "," "," "," "," "," "," "," "," "," "," "," "," "," "," "," "," "," "," "," "," "," "," "," "," "," "," "," "," "," "," "]
[null,null,"P88888888888944",1,"TO",12,"SHORT",13,"AND",14,"MONIT"," "," "," "," "," "," "," "," "," "," "," "," "," "," "," "," "," "," "," "," "," "," "," "," "," "," "," "," "," "," "," "," "," "," "," "," "," "," "," "," "," "," "," "," "," "," "," "," "]
[null,null,"P88888888888945",1,"TO",12,"SHORT",13," "," ","MONIT",14," "," ","ISOL"," "," "," "," "," "," "," "," "," "," "," "," "," "," "," "," "," "," "," "," "," "," "," "," "," "," "," "," "," "," "," "," "," "," "," "," "," "," "," "," "," "," "," "," "]
[null,null,"P88888888888989",1,"TO",14,"SHORT"," "," "," "," "," "," "," "," "," "," "," "," "," "," "," "," "," "," "," "," "," "," "," "," "," "," "," "," "," "," "," "," "," "," "," "," "," "," "," "," "," "," "," "," "," "," "," "," "," "," "," "," "]
[null,null,"P88888888889110",1,"TO",11,"SHORT",12,"TO",13,"STAGE1",14," "," ","ISOL"," "," "," "," "," "," "," "," "," "," "," "," "," "," "," "," "," "," "," "," "," "," "," "," "," "," "," "," "," "," "," "," "," "," "," "," "," "," "," "," "," "," "," "," "]
[null,null,"P88888888889111",1,"TO",11,"SHORT",12,"TO",14,"STAGE1"," "," "," "," "," "," "," "," "," "," "," "," "," "," "," "," "," "," "," "," "," "," "," "," "," "," "," "," "," "," "," "," "," "," "," "," "," "," "," "," "," "," "," "," "," "," "," "," "]
[null,null,"P88888888889112",1,"TO",11,"SHORT",12,"TO",13,"STAGE1",14," "," ","STAGE2"," "," "," "," "," "," "," "," "," "," "," "," "," "," "," "," "," "," "," "," "," "," "," "," "," "," "," "," "," "," "," "," "," "," "," "," "," "," "," "," "," "," "," "," "]
[null,null,"P88888888889113",1,"TO",11,"SHORT",12,"TO",13,"STAGE1",14," "," ","STAGE3"," "," "," "," "," "," "," "," "," "," "," "," "," "," "," "," "," "," "," "," "," "," "," "," "," "," "," "," "," "," "," "," "," "," "," "," "," "," "," "," "," "," "," "," "]
[null,null,"P88888888889114",1,"TO",11,"SHORT",12,"TO",13,"STAGE1",14," "," ","MONIT"," "," "," "," "," "," "," "," "," "," "," "," "," "," "," "," "," "," "," "," "," "," "," "," "," "," "," "," "," "," "," "," "," "," "," "," "," "," "," "," "," "," "," "," "]
[null,null,"P88888888889121",1,"TO",11,"SHORT",12," "," ","STAGE1",13," "," ","STAGE2",14," "," ","STAGE1"," "," "," "," "," "," "," "," "," "," "," "," "," "," "," "," "," "," "," "," "," "," "," "," "," "," "," "," "," "," "," "," "," "," "," "," "," "," "," "," "]
[null,null,"P88888888889122",1,"TO",11,"SHORT",12," "," ","STAGE1",13,"AND",14,"STAGE2"," "," "," "," "," "," "," "," "," "," "," "," "," "," "," "," "," "," "," "," "," "," "," "," "," "," "," "," "," "," "," "," "," "," "," "," "," "," "," "," "," "," "," "," "]
[null,null,"P88888888889123",1,"TO",11,"SHORT",12," "," ","STAGE1",13," "," ","STAGE2",14," "," ","STAGE3"," "," "," "," "," "," "," "," "," "," "," "," "," "," "," "," "," "," "," "," "," "," "," "," "," "," "," "," "," "," "," "," "," "," "," "," "," "," "," "," "]
[null,null,"P88888888889124",1,"TO",11,"SHORT",12," "," ","STAGE1",13," "," ","STAGE2",14," "," ","MONIT"," "," "," "," "," "," "," "," "," "," "," "," "," "," "," "," "," "," "," "," "," "," "," "," "," "," "," "," "," "," "," "," "," "," "," "," "," "," "," "," "]
[null,null,"P88888888889189",1,"TO",11,"SHORT",12," "," ","STAGE1",13,"AND",14,"SHORT"," "," "," "," "," "," "," "," "," "," "," "," "," "," "," "," "," "," "," "," "," "," "," "," "," "," "," "," "," "," "," "," "," "," "," "," "," "," "," "," "," "," "," "," "]
[null,null,"P88888888889889",1,"TO",11,"SHORT",12,"TO",14,"SHORT"," "," "," "," "," "," "," "," "," "," "," "," "," "," "," "," "," "," "," "," "," "," "," "," "," "," "," "," "," "," "," "," "," "," "," "," "," "," "," "," "," "," "," "," "," "," "," "," "]
[null,null,"P88888888889890",1,"TO",11,"SHORT",12,"AND",13,"SHORT",14," "," ","ISOL"," "," "," "," "," "," "," "," "," "," "," "," "," "," "," "," "," "," "," "," "," "," "," "," "," "," "," "," "," "," "," "," "," "," "," "," "," "," "," "," "," "," "," "," "]
[null,null,"P88888888889891",1,"TO",11,"SHORT",12,"AND",13,"SHORT",14," "," ","STAGE1"," "," "," "," "," "," "," "," "," "," "," "," "," "," "," "," "," "," "," "," "," "," "," "," "," "," "," "," "," "," "," "," "," "," "," "," "," "," "," "," "," "," "," "," "]
[null,null,"P88888888889892",1,"TO",11,"SHORT",12,"AND",13,"SHORT",14," "," ","STAGE2"," "," "," "," "," "," "," "," "," "," "," "," "," "," "," "," "," "," "," "," "," "," "," "," "," "," "," "," "," "," "," "," "," "," "," "," "," "," "," "," "," "," "," "," "]
[null,null,"P88888888889893",1,"TO",11,"SHORT",12,"AND",13,"SHORT",14," "," ","STAGE3"," "," "," "," "," "," "," "," "," "," "," "," "," "," "," "," "," "," "," "," "," "," "," "," "," "," "," "," "," "," "," "," "," "," "," "," "," "," "," "," "," "," "," "," "]
[null,null,"P88888888889894",1,"TO",11,"SHORT",12,"AND",13,"SHORT",14," "," ","MONIT"," "," "," "," "," "," "," "," "," "," "," "," "," "," "," "," "," "," "," "," "," "," "," "," "," "," "," "," "," "," "," "," "," "," "," "," "," "," "," "," "," "," "," "," "]
[null,null,"P88891111118889",1,"TO",4,"SHORT",5,"TO",10,"STAGE1",11,"TO",14,"SHORT"," "," "," "," "," "," "," "," "," "," "," "," "," "," "," "," "," "," "," "," "," "," "," "," "," "," "," "," "," "," "," "," "," "," "," "," "," "," "," "," "," "," "," "," "]
[null,null,"P88893311118889",1,"TO",4,"SHORT",5,"AND",6,"STAGE3",7,"TO",10,"STAGE1",11,"TO",14,"SHORT"," "," "," "," "," "," "," "," "," "," "," "," "," "," "," "," "," "," "," "," "," "," "," "," "," "," "," "," "," "," "," "," "," "," "," "," "," "," "," "," "]
[null,null,"P88891133118889",1,"TO",4,"SHORT",5,"AND",6,"STAGE1",7,"AND",8,"STAGE3",9,"AND",10,"STAGE1",11,"TO",14,"SHORT"," "," "," "," "," "," "," "," "," "," "," "," "," "," "," "," "," "," "," "," "," "," "," "," "," "," "," "," "," "," "," "," "," "," "," "," "]