{"text_format":"1","workbook":"xlsx","n_sheets":10,"sheets":["Disclaimer","Cortec","Nomenclature","Date Drivers","Lookup","Master Text","MIFAS Data","Routing","Routing DB","Database"],"not_rendered":{"charts":0,"images":0,"macros":1,"external_links":0,"defined_names":5,"comments":0,"pivot_tables":0},"unopened":[],"bounds":{"document_bytes":16777216,"sheet_cells":100000,"rows_first":2000,"rows_last":500,"rows_between":2000,"halvings":0,"cell_chars":16384,"cell_head_chars":4096},"cells_cut":0,"cells_raw":0,"read":"whole","date_system":"1900"}

{"sheet":"Disclaimer","index":0,"n_rows":6,"n_cols":2,"rows_kept":6,"cut":false,"hidden":false,"merged":[[2,1,2,9],[5,1,7,9],[3,1,4,9]]}
[]
[]
[null,"Our policy is one of continuous development. Accordingly the design of our products may change at any time. "]
[null,"Whilst every effort is made to produce up to date literature, this document should only be regarded as a guide and is intended for information purposes only."]
[]
[null,"Its contents do not constitute an offer for sale or advice on the application of any product referred to in it. We cannot be held responsible for any reliance on any decisions taken on its contents without specific advice."]

{"sheet":"Cortec","index":1,"n_rows":39,"n_cols":20,"rows_kept":39,"cut":false,"hidden":false,"merged":[[5,0,5,2],[13,0,13,2],[22,0,22,2]]}
[null,"P991 CORTEC"]
[]
["Issue:"]
["See Model List (Factory Defined)"]
[]
["Cassette #14"]
["ONLY if Cassette #13 is \"C.T. shorted to the cassette below\"","C.T. shorted to the cassette above",9]
["ONLY if Cassette #1 is NOT \"C.T. shorted to the cassette below\"","Stage 1 (first contact to be closed - e.g. trip circuit)","1"]
["ONLY if Cassette #1 is NOT \"C.T. shorted to the cassette below\"","Stage 2 (second contact to be closed - e.g. aux.supply or I/O)","2"]
["ONLY if Cassette #1 is NOT \"C.T. shorted to the cassette below\"","Stage 3 (third contact to be closed - e.g. VT)","3"]
["ONLY if Cassette #1 is NOT \"C.T. shorted to the cassette below\"","Monitoring points (for monitoring I/O without breaking connection to relay)","4"]
["ONLY if Cassette #1 is NOT \"C.T. shorted to the cassette below\"","Blank cassette (for labelling and isolation)","0"]
[]
["Cassette #2 to 13 (inclusive)"]
[null,"C.T. shorted to the cassette below","8"]
["ONLY if Cassette #1 is \"C.T. shorted to the cassette below\"","C.T. shorted to the cassette above","9"]
["ONLY if Cassette #1 is NOT \"C.T. shorted to the cassette below\"","Stage 1 (first contact to be closed - e.g. trip circuit)","1"]
["ONLY if Cassette #1 is NOT \"C.T. shorted to the cassette below\"","Stage 2 (second contact to be closed - e.g. aux.supply or I/O)","2"]
["ONLY if Cassette #1 is NOT \"C.T. shorted to the cassette below\"","Stage 3 (third contact to be closed - e.g. VT)","3"]
["ONLY if Cassette #1 is NOT \"C.T. shorted to the cassette below\"","Monitoring points (for monitoring I/O without breaking connection to relay)","4"]
{"$rows_left_out":20}
{"sheet":"Nomenclature","index":2,"n_rows":42,"n_cols":39,"rows_kept":42,"cut":false,"hidden":false,"merged":[[39,2,39,13],[0,0,0,16],[1,1,1,5],[41,3,41,17]]}
["BEFORE Selecting your particular configuration please specify your preferred despatch date to enable us to check for variant availability."]
[null," (Using format dd/mm/yyyy where dd=day, mm=month & yyyy=year)"]
[null,"Despatch date",null,"Despatch date"]
["Cassette","Number","NOMENCLATURE for \"New\" Test Block - P990 Range"]
["position","of"]
["numbered 1 to 14","possible","Select ONE cassette option for each of the 14 positions",null,null,null,null,null,null,null,null,null,null,null,null,null,null,null,null,null,2,3,4,5,6,7,8,9,10,11,12,13,14]
["top to","options","P991 Test Block Model Variant Number:","P",{"$f":"D9","v":2},{"$f":"$D$11","v":2},{"$f":"D13","v":2},{"$f":"D15","v":2},{"$f":"D17","v":2},{"$f":"D19","v":2},{"$f":"D21","v":0},{"$f":"D23","v":0},{"$f":"D25","v":0},{"$f":"D27","v":0},{"$f":"D29","v":0},{"$f":"D31","v":0},{"$f":"D33","v":0},{"$f":"D35","v":0},{"$f":"D37","v":"D"},null,null,null,null,null,null,null,null,null,null,null,null,null,null,null,null,null,null,null,4]
["bottom","listed"]
[1,6,null,{"$f":"VLOOKUP(Lookup!$A$49,Lookup!$B$50:$D$55,3)","v":2}]
[]
[2,{"$f":"HLOOKUP(Lookup!$E$56,Lookup!$D$40:$F$47,8)","v":6},null,{"$f":"VLOOKUP(Lookup!$A$56,Lookup!$B$57:$D$62,3)","v":2}]
[]
[3,{"$f":"HLOOKUP(Lookup!$E$63,Lookup!$G$40:$I$47,8)","v":6},null,{"$f":"VLOOKUP(Lookup!$A$63,Lookup!$B$64:$D$69,3)","v":2}]
[]
[4,{"$f":"HLOOKUP(Lookup!$E$70,Lookup!$G$40:$I$47,8)","v":6},null,{"$f":"VLOOKUP(Lookup!$A$70,Lookup!$B$71:$D$76,3)","v":2}]
[]
[5,{"$f":"HLOOKUP(Lookup!$E$77,Lookup!$G$40:$I$47,8)","v":6},null,{"$f":"VLOOKUP(Lookup!$A$77,Lookup!$B$78:$D$83,3)","v":2}]
[]
[6,{"$f":"HLOOKUP(Lookup!$E$84,Lookup!$G$40:$I$47,8)","v":6},null,{"$f":"VLOOKUP(Lookup!$A$84,Lookup!$B$85:$D$90,3)","v":2}]
[]
{"$rows_left_out":23}
{"sheet":"Date Drivers","index":3,"n_rows":57,"n_cols":8,"rows_kept":57,"cut":false,"hidden":true,"merged":[]}
[null,"2001-01-01","2001-04-01","2002-01-08","2002-03-26","2002-09-04","2004-10-19","2005-09-29"]
[1,"First despatch date available : 01/04/2001","C.T. with shorting link to cassette ","C.T. with shorting link to cassette ","C.T. with shorting link to cassette ","C.T. with shorting link to cassette ","C.T. with shorting link to cassette ","C.T. with shorting link to cassette "]
[2," ","Stage 1 (first contact to be made - e.g. trip circuit)","Stage 1 (first contact to be made - e.g. trip circuit)","Stage 1 (first contact to be made - e.g. trip circuit)","Stage 1 (first contact to be made - e.g. trip circuit)","Stage 1 (first contact to be made - e.g. trip circuit)","Stage 1 (first contact to be made - e.g. trip circuit)"]
[3," ","Stage 2 (second contact to be made - e.g. aux.supply or I/O)","Stage 2 (second contact to be made - e.g. aux.supply or I/O)","Stage 2 (second contact to be made - e.g. aux.supply or I/O)","Stage 2 (second contact to be made - e.g. aux.supply or I/O)","Stage 2 (second contact to be made - e.g. aux.supply or I/O)","Stage 2 (second contact to be made - e.g. aux.supply or I/O)"]
[4," ","Stage 3 (third contact to be made - e.g. VT)","Stage 3 (third contact to be made - e.g. VT)","Stage 3 (third contact to be made - e.g. VT)","Stage 3 (third contact to be made - e.g. VT)","Stage 3 (third contact to be made - e.g. VT)","Stage 3 (third contact to be made - e.g. VT)"]
[5," ","Monitoring points (for monitoring I/O without breaking connection to relay)","Monitoring points (for monitoring I/O without breaking connection to relay)","Monitoring points (for monitoring I/O without breaking connection to relay)","Monitoring points (for monitoring I/O without breaking connection to relay)","Monitoring points (for monitoring I/O without breaking connection to relay)","Monitoring points (for monitoring I/O without breaking connection to relay)"]
[6," ","Blank cassette (for labelling and isolation)","Blank cassette (for labelling and isolation)","Blank cassette (for labelling and isolation)","Blank cassette (for labelling and isolation)","Blank cassette (for labelling and isolation)","Blank cassette (for labelling and isolation)"]
[1,"*",8,8,8,8,8,8]
[2,"*",1,1,1,1,1,1]
[3,"*",2,2,2,2,2,2]
[4,"*",3,3,3,3,3,3]
[5,"*",4,4,4,4,4,4]
[6,"*",0,0,0,0,0,0]
["Design Suffix Key",{"$f":"IF(Nomenclature!$C$3=\"\",TODAY(),Nomenclature!$C$3)","v":"2024-01-02"}]
["Design Suffix"," "," ","B","C","C","C","C"]
[null,"Shorting Bars","CT Shorting Bar - 2 Way","CT Shorting Bar - 2 Way","CT Shorting Bar - 2 Way","CT Shorting Bar - 2 Way","CT Shorting Bar - 2 Way","CT Shorting Bar - 2 Way"]
[null,null,"CT Shorting Bar - 3 Way","CT Shorting Bar - 3 Way","CT Shorting Bar - 3 Way","CT Shorting Bar - 3 Way","CT Shorting Bar - 3 Way","CT Shorting Bar - 3 Way"]
[null,null,"CT Shorting Bar - 4 Way","CT Shorting Bar - 4 Way","CT Shorting Bar - 4 Way","CT Shorting Bar - 4 Way","CT Shorting Bar - 4 Way","CT Shorting Bar - 4 Way"]
[null,null,"CT Shorting Bar - 5 Way","CT Shorting Bar - 5 Way","CT Shorting Bar - 5 Way","CT Shorting Bar - 5 Way","CT Shorting Bar - 5 Way","CT Shorting Bar - 5 Way"]
[null,null,"CT Shorting Bar - 6 Way","CT Shorting Bar - 6 Way","CT Shorting Bar - 6 Way","CT Shorting Bar - 6 Way","CT Shorting Bar - 6 Way","CT Shorting Bar - 6 Way"]
{"$rows_left_out":38}
{"sheet":"Lookup","index":4,"n_rows":181,"n_cols":12,"rows_kept":181,"cut":false,"hidden":true,"merged":[[139,1,139,3],[48,1,48,3],[104,1,104,3],[111,1,111,3],[118,1,118,3],[125,1,125,3],[76,1,76,3],[83,1,83,3],[90,1,90,3],[132,1,132,3],[18,1,18,2],[1,1,1,2],[29,1,29,2],[7,1,7,2],[97,1,97,3],[55,1,55,3],[62,1,62,3],[69,1,69,3]]}
["Seven possible scenarios exist(of which some may be duplicates):"]
[1,"For the first cassette ALL options EXCEPT \"C.T. shorted to cassette above\" must be offered",null,"Scenario #1",1,"C.T. shorted to the cassette below","0"]
[null,null,null,null,3,"Stage 1 (first contact to be closed - e.g. trip circuit)","2"]
[null,null,null,null,4,"Stage 2 (second contact to be closed - e.g. aux.supply or I/O)","3"]
[null,null,null,null,5,"Stage 3 (third contact to be closed - e.g. VT)","4"]
[null,null,null,null,6,"Monitoring points (for monitoring I/O without breaking connection to relay)","5"]
[null,null,null,null,7,"Blank cassette (for labelling and isolation)","6"]
[2,"For the second cassette there are two possibilities:"]
[null,"a)","Where cassette #1 was a \"C.T. shorted to the cassette below\" type ONLY another \"C.T. shorted to the cassette below\" OR a \"C.T. shorted to the cassette above\" options must be offered","Scenario #2a)",1,"C.T. shorted to the cassette below","0"]
[null,null,null,null,2,"C.T. shorted to the cassette above","1"]
[]
[null,"b)","Where cassette #1 was anything other than a  \"C.T. shorted to the cassette below\" type ALL options must be offered","Scenario #2b)",1,"C.T. shorted to the cassette below","0"]
[null,null,null,null,3,"Stage 1 (first contact to be made - e.g. trip circuit)","2"]
[null,null,null,null,4,"Stage 2 (second contact to be made - e.g. aux.supply or I/O)","3"]
[null,null,null,null,5,"Stage 3 (third contact to be made - e.g. VT)","4"]
[null,null,null,null,6,"Monitoring points (for monitoring I/O without breaking connection to relay)","5"]
[null,null,null,null,7,"Blank cassette (for labelling and isolation)","6"]
[]
[3,"For the third to thirteenth cassettes there are two possibilities:"]
[null,"a)","Where the previous cassette was either a \"C.T. shorted to the cassette below\" OR a \"C.T. shorted to the cassette above\" type EITHER a \"C.T. shorted to the cassette below\" OR a \"C.T. shorted to the cassette above\" options must be offered.","Scenario #3a)",1,"C.T. shorted to the cassette below","0"]
{"$rows_left_out":162}
{"sheet":"Master Text","index":5,"n_rows":46,"n_cols":3,"rows_kept":46,"cut":false,"hidden":false,"merged":[]}
[{"$f":"CONCATENATE(Nomenclature!$D$7,Nomenclature!$E$7,Nomenclature!$F$7,Nomenclature!$G$7,Nomenclature!$H$7,Nomenclature!$I$7,Nomenclature!$J$7,Nomenclature!$K$7,Nomenclature!$L$7,Nomenclature!$M$7,Nomenclature!$N$7,Nomenclature!$O$7,Nomenclature!$P$7,Nomenclature!$Q$7,Nomenclature!$R$7,Nomenclature!$S$7)","v":"P22222200000000D"},{"$f":"A1","v":"P22222200000000D"}]
[null,"P991 NEW TEST BLOCK"]
[null,"FOR USE ONLY WITH :"]
[null,"P992 - MULTI-FINGER TEST PLUG"]
[null,"P993 - SINGLE FINGER TEST PLUG"]
[null,"P994 - SINGLE FINGER ISOLATING PLUG"]
[]
[null,"RATED","300V, 20A"]
[{"$f":"MID($A$1,2,1)","v":"2"},"SLOT 1",{"$f":"VLOOKUP(A9,$A$25:$B$31,2,FALSE)","v":"Stage 2"}]
[{"$f":"MID($A$1,3,1)","v":"2"},"SLOT 2",{"$f":"VLOOKUP(A10,$A$25:$B$31,2,FALSE)","v":"Stage 2"}]
[{"$f":"MID($A$1,4,1)","v":"2"},"SLOT 3","Stage 2"]
[{"$f":"MID($A$1,5,1)","v":"2"},"SLOT 4","Stage 2"]
[{"$f":"MID($A$1,6,1)","v":"2"},"SLOT 5","Stage 2"]
[{"$f":"MID($A$1,7,1)","v":"2"},"SLOT 6","Stage 2"]
[{"$f":"MID($A$1,8,1)","v":"0"},"SLOT 7","Blank Cassette"]
[{"$f":"MID($A$1,9,1)","v":"0"},"SLOT 8","Blank Cassette"]
[{"$f":"MID($A$1,10,1)","v":"0"},"SLOT 9","Blank Cassette"]
[{"$f":"MID($A$1,11,1)","v":"0"},"SLOT 10","Blank Cassette"]
[{"$f":"MID($A$1,12,1)","v":"0"},"SLOT 11","Blank Cassette"]
[{"$f":"MID($A$1,13,1)","v":"0"},"SLOT 12","Blank Cassette"]
{"$rows_left_out":27}
{"sheet":"MIFAS Data","index":6,"n_rows":72,"n_cols":8,"rows_kept":72,"cut":false,"hidden":true,"merged":[[6,3,8,5]]}
[null,"P990 TEST BLOCK - RATING OPTIONS"]
[null,"(No name)",null,null,null,null,"MODEL"]
["MODEL RANGE :","P990","D/S :",{"$f":"Nomenclature!$S$7","v":"D"},"ISSUE :",5,"TYPE :","MIDOS"]
["MODEL NUMBER :",{"$f":"CONCATENATE(Nomenclature!D7,Nomenclature!E7,Nomenclature!F7,Nomenclature!G7,Nomenclature!H7,Nomenclature!I7,Nomenclature!J7,Nomenclature!K7,Nomenclature!L7,Nomenclature!M7,Nomenclature!N7,Nomenclature!O7,Nomenclature!P7,Nomenclature!Q7,Nomenclature!R7,Nomenclature!S7)","v":"P22222200000000D"},null,null,null,"PGROUP",111011]
["SCHEME Y/N: ","N           MODULAR Y/N: N",null,null,null,"Units",1]
[]
["(Maximum : 60 characters)","MICOM P991 TEST BLOCK",null,"NOTE : THESE RATING/TECHNICAL DETAILS ARE TYPICAL ONLY. EACH CONFIGURATION SHOULD BE REVIEWED/REVISED AT POINT OF CREATION."]
["(Maximum : 60 characters)","FOR USE ONLY WITH :"]
["(Maximum : 60 characters)","P992 - MULTI-FINGER TEST PLUG"]
["(Maximum : 60 characters)","P993 - SINGLE FINGER TEST PLUG"]
["(Maximum : 60 characters)","If it is necessary to reconfigure the P991 build after manufacture, then for safety reasons,"]
[null,"the assemblies must be returned to the manufacturing plant, for this purpose"]
[]
["MODEL SKELETON :","ANNNNNNNNNNNNNNXXXX","FROM",null,"TO"]
["CODE","DESCRIPTION","VALUE","UNIT","VALUE","UNIT"]
["(Page 1)"]
[1,"RATED",300,"V",20,"A"]
[2,"SLOT #",1,{"$f":"VLOOKUP(Database!$C$1,Database!$C$2:$BG$706,3)","v":"TO"},{"$f":"VLOOKUP(Database!$C$1,Database!$C$2:$BG$706,4)","v":4},{"$f":"VLOOKUP(Database!$C$1,Database!$C$2:$BG$706,5)","v":"STAGE2"}]
[3,"SLOT #",{"$f":"VLOOKUP(Database!$C$1,Database!$C$2:$BG$706,6)","v":5},{"$f":"VLOOKUP(Database!$C$1,Database!$C$2:$BG$706,7)","v":"AND"},{"$f":"VLOOKUP(Database!$C$1,Database!$C$2:$BG$706,8)","v":6},{"$f":"VLOOKUP(Database!$C$1,Database!$C$2:$BG$706,9)","v":"STAGE1"}]
[4,"SLOT #",{"$f":"VLOOKUP(Database!$C$1,Database!$C$2:$BG$706,10)","v":7},{"$f":"VLOOKUP(Database!$C$1,Database!$C$2:$BG$706,11)","v":"AND"},{"$f":"VLOOKUP(Database!$C$1,Database!$C$2:$BG$706,12)","v":8},{"$f":"VLOOKUP(Database!$C$1,Database!$C$2:$BG$706,13)","v":"STAGE3"}]
{"$rows_left_out":53}
{"sheet":"Routing","index":7,"n_rows":9,"n_cols":5,"rows_kept":9,"cut":false,"hidden":true,"merged":[]}
[]
[null,"Model No:",{"$f":"'MIFAS Data'!B4","v":"P22222200000000D"}]
[null,"Ref Op. Set 50000141"]
[null,"Pre-Production Ref. Op. Set. 50000121"]
[]
[null,"104BA","Assemble cassette as per drawing GN0078",{"$f":"'Routing DB'!$D$10","v":11.600000000000003},"Mins"]
[null,"104BA","Test cassette as per test spec",{"$f":"'Routing DB'!$D$18","v":1.2},"Mins"]
[null,"104BA","Final Assembly",{"$f":"'Routing DB'!$E$36","v":6.25},"Mins"]
[null,"104BQ","Function Test & Product Check",1.8,"Mins"]

{"sheet":"Routing DB","index":8,"n_rows":40,"n_cols":20,"rows_kept":40,"cut":false,"hidden":true,"merged":[]}
[]
[null,null,null,null,null,null,1,2,3,4,5,6,7,8,9,10,11,12,13,14]
["ASSEMBLE CASSETTE ",null,"B.M.T",null,null,null,{"$f":"Nomenclature!$D$9","v":2},{"$f":"Nomenclature!$D$11","v":2},{"$f":"Nomenclature!$D$13","v":2},{"$f":"Nomenclature!$D$15","v":2},{"$f":"Nomenclature!$D$17","v":2},{"$f":"Nomenclature!$D$19","v":2},{"$f":"Nomenclature!$D$21","v":0},{"$f":"Nomenclature!$D$23","v":0},{"$f":"Nomenclature!$D$25","v":0},{"$f":"Nomenclature!$D$27","v":0},{"$f":"Nomenclature!$D$29","v":0},{"$f":"Nomenclature!$D$31","v":0},{"$f":"Nomenclature!$D$33","v":0},{"$f":"Nomenclature!$D$35","v":0}]
["Stage 1     GN0078001",1,1.4,null,null,null,{"$f":"VLOOKUP(G3,$G$9:$H$15,2)","v":1.4},{"$f":"VLOOKUP($H$3,$G$9:$H$15,2)","v":1.4},{"$f":"VLOOKUP($I$3,$G$9:$H$15,2)","v":1.4},{"$f":"VLOOKUP($J$3,$G$9:$H$15,2)","v":1.4},{"$f":"VLOOKUP($K$3,$G$9:$H$15,2)","v":1.4},{"$f":"VLOOKUP($L$3,$G$9:$H$15,2)","v":1.4},{"$f":"VLOOKUP($M$3,$G$9:$H$15,2)","v":0.4},{"$f":"VLOOKUP($N$3,$G$9:$H$15,2)","v":0.4},{"$f":"VLOOKUP($O$3,$G$9:$H$15,2)","v":0.4},{"$f":"VLOOKUP($P$3,$G$9:$H$15,2)","v":0.4},{"$f":"VLOOKUP($Q$3,$G$9:$H$15,2)","v":0.4},{"$f":"VLOOKUP($R$3,$G$9:$H$15,2)","v":0.4},{"$f":"VLOOKUP($S$3,$G$9:$H$15,2)","v":0.4},{"$f":"VLOOKUP($T$3,$G$9:$H$15,2)","v":0.4}]
["Stage 2     GN0078002",2,1.4,null,null,null,{"$f":"VLOOKUP($G$3,$G$9:$I$15,3)","v":0.2},{"$f":"VLOOKUP($H$3,$G$9:$I$15,3)","v":0.2},{"$f":"VLOOKUP($I$3,$G$9:$I$15,3)","v":0.2},{"$f":"VLOOKUP($J$3,$G$9:$I$15,3)","v":0.2},{"$f":"VLOOKUP($K$3,$G$9:$I$15,3)","v":0.2},{"$f":"VLOOKUP($L$3,$G$9:$I$15,3)","v":0.2},{"$f":"VLOOKUP($M$3,$G$9:$I$15,3)","v":0},{"$f":"VLOOKUP($N$3,$G$9:$I$15,3)","v":0},{"$f":"VLOOKUP($O$3,$G$9:$I$15,3)","v":0},{"$f":"VLOOKUP($P$3,$G$9:$I$15,3)","v":0},{"$f":"VLOOKUP($Q$3,$G$9:$I$15,3)","v":0},{"$f":"VLOOKUP($R$3,$G$9:$I$15,3)","v":0},{"$f":"VLOOKUP($S$3,$G$9:$I$15,3)","v":0},{"$f":"VLOOKUP($T$3,$G$9:$I$15,3)","v":0}]
["Stage 3     GN0078003",3,1.4]
["C/T           GN0078004   ","8 or 9",1.5]
["Monitor     GN0078005",4,1.4]
["Blank       GN0078006  ",0,0.4,null,null,null,0,0.4,0]
["TOTAL  (Quantity Must be 14)",null,null,{"$f":"SUM(G4:T4)","v":11.600000000000003},null,null,1,1.4,0.2]
[null,null,null,null,null,null,2,1.4,0.2]
["TEST CASSETTE [ Flash Test ]",null,null,null,null,null,3,1.4,0.2]
["Stage 1     GN0078001",1,0.2,null,null,null,4,1.4,0.2]
["Stage 2     GN0078002",2,0.2,null,null,null,8,1.5,0.2]
["Stage 3     GN0078003",3,0.2,null,null,null,9,1.5,0.2]
["C/T           GN0078004   ","8 or 9",0.2]
["Monitor     GN0078005",4,0.2]
[null,null,null,{"$f":"SUM(G5:T5)","v":1.2}]
[]
["FINAL ASSEMBLE"]
{"$rows_left_out":21}
{"sheet":"Database","index":9,"n_rows":706,"n_cols":59,"rows_kept":706,"cut":false,"hidden":true,"merged":[]}
["Ratings/Attributes","Key",{"$f":"'MIFAS Data'!$B$4","v":"P22222200000000D"},"SLOT # 1",null,null,null,"SLOT # 2",null,null,null,"SLOT # 3",null,null,null,"SLOT # 4",null,null,null,"SLOT # 5",null,null,null,"SLOT # 6",null,null,null,"SLOT # 7",null,null,null,"SLOT # 8",null,null,null,"SLOT # 9",null,null,null,"SLOT # 10",null,null,null,"SLOT # 11",null,null,null,"SLOT # 12",null,null,null,"SLOT # 13",null,null,null,"SLOT # 14"]
[null,null,"P11110022008889",1,"TO",4,"STAGE1",5,"AND",6,"ISOL",7,"AND",8,"STAGE2",9,"AND",10,"ISOL",11,"TO",14,"SHORT"," "," "," "," "," "," "," "," "," "," "," "," "," "," "," "," "," "," "," "," "," "," "," "," "," "," "," "," "," "," "," "," "," "," "," "," "]
[null,null,"P11111111111100",1,"TO",12,"STAGE1",13,"AND",14,"ISOL"," "," "," "," "," "," "," "," "," "," "," "," "," "," "," "," "," "," "," "," "," "," "," "," "," "," "," "," "," "," "," "," "," "," "," "," "," "," "," "," "," "," "," "," "," "," "," "," "]
[null,null,"P11111111111101",1,"TO",12,"STAGE1",13," "," ","ISOL",14," "," ","STAGE1"," "," "," "," "," "," "," "," "," "," "," "," "," "," "," "," "," "," "," "," "," "," "," "," "," "," "," "," "," "," "," "," "," "," "," "," "," "," "," "," "," "," "," "," "]
[null,null,"P11111111111102",1,"TO",12,"STAGE1",13," "," ","ISOL",14," "," ","STAGE2"," "," "," "," "," "," "," "," "," "," "," "," "," "," "," "," "," "," "," "," "," "," "," "," "," "," "," "," "," "," "," "," "," "," "," "," "," "," "," "," "," "," "," "," "]
[null,null,"P11111111111103",1,"TO",12,"STAGE1",13," "," ","ISOL",14," "," ","STAGE3"," "," "," "," "," "," "," "," "," "," "," "," "," "," "," "," "," "," "," "," "," "," "," "," "," "," "," "," "," "," "," "," "," "," "," "," "," "," "," "," "," "," "," "," "]
[null,null,"P11111111111104",1,"TO",12,"STAGE1",13," "," ","ISOL",14," "," ","MONIT"," "," "," "," "," "," "," "," "," "," "," "," "," "," "," "," "," "," "," "," "," "," "," "," "," "," "," "," "," "," "," "," "," "," "," "," "," "," "," "," "," "," "," "," "]
[null,null,"P11111111111110",1,"TO",13,"STAGE1",14," "," ","ISOL"," "," "," "," "," "," "," "," "," "," "," "," "," "," "," "," "," "," "," "," "," "," "," "," "," "," "," "," "," "," "," "," "," "," "," "," "," "," "," "," "," "," "," "," "," "," "," "," "]
[null,null,"P11111111111111",1,"TO",14,"STAGE1"," "," "," "," "," "," "," "," "," "," "," "," "," "," "," "," "," "," "," "," "," "," "," "," "," "," "," "," "," "," "," "," "," "," "," "," "," "," "," "," "," "," "," "," "," "," "," "," "," "," "," "," "]
[null,null,"P11111111111112",1,"TO",13,"STAGE1",14," "," ","STAGE2"," "," "," "," "," "," "," "," "," "," "," "," "," "," "," "," "," "," "," "," "," "," "," "," "," "," "," "," "," "," "," "," "," "," "," "," "," "," "," "," "," "," "," "," "," "," "," "," "]
[null,null,"P11111111111113",1,"TO",13,"STAGE1",14," "," ","STAGE3"," "," "," "," "," "," "," "," "," "," "," "," "," "," "," "," "," "," "," "," "," "," "," "," "," "," "," "," "," "," "," "," "," "," "," "," "," "," "," "," "," "," "," "," "," "," "," "," "]
[null,null,"P11111111111114",1,"TO",13,"STAGE1",14," "," ","MONIT"," "," "," "," "," "," "," "," "," "," "," "," "," "," "," "," "," "," "," "," "," "," "," "," "," "," "," "," "," "," "," "," "," "," "," "," "," "," "," "," "," "," "," "," "," "," "," "," "]
[null,null,"P11111111111120",1,"TO",12,"STAGE1",13," "," ","STAGE2",14," "," ","ISOL"," "," "," "," "," "," "," "," "," "," "," "," "," "," "," "," "," "," "," "," "," "," "," "," "," "," "," "," "," "," "," "," "," "," "," "," "," "," "," "," "," "," "," "," "]
[null,null,"P11111111111121",1,"TO",12,"STAGE1",13," "," ","STAGE2",14," "," ","STAGE1"," "," "," "," "," "," "," "," "," "," "," "," "," "," "," "," "," "," "," "," "," "," "," "," "," "," "," "," "," "," "," "," "," "," "," "," "," "," "," "," "," "," "," "," "]
[null,null,"P11111111111122",1,"TO",12,"STAGE1",13,"AND",14,"STAGE2"," "," "," "," "," "," "," "," "," "," "," "," "," "," "," "," "," "," "," "," "," "," "," "," "," "," "," "," "," "," "," "," "," "," "," "," "," "," "," "," "," "," "," "," "," "," "," "," "]
[null,null,"P11111111111123",1,"TO",12,"STAGE1",13," "," ","STAGE2",14," "," ","STAGE3"," "," "," "," "," "," "," "," "," "," "," "," "," "," "," "," "," "," "," "," "," "," "," "," "," "," "," "," "," "," "," "," "," "," "," "," "," "," "," "," "," "," "," "," "]
[null,null,"P11111111111124",1,"TO",12,"STAGE1",13," "," ","STAGE2",14," "," ","MONIT"," "," "," "," "," "," "," "," "," "," "," "," "," "," "," "," "," "," "," "," "," "," "," "," "," "," "," "," "," "," "," "," "," "," "," "," "," "," "," "," "," "," "," "," "]
[null,null,"P11111111111130",1,"TO",12,"STAGE1",13," "," ","STAGE3",14," "," ","ISOL"," "," "," "," "," "," "," "," "," "," "," "," "," "," "," "," "," "," "," "," "," "," "," "," "," "," "," "," "," "," "," "," "," "," "," "," "," "," "," "," "," "," "," "," "]
[null,null,"P11111111111131",1,"TO",12,"STAGE1",13," "," ","STAGE3",14," "," ","STAGE1"," "," "," "," "," "," "," "," "," "," "," "," "," "," "," "," "," "," "," "," "," "," "," "," "," "," "," "," "," "," "," "," "," "," "," "," "," "," "," "," "," "," "," "," "]
[null,null,"P11111111111132",1,"TO",12,"STAGE1",13," "," ","STAGE3",14," "," ","STAGE2"," "," "," "," "," "," "," "," "," "," "," "," "," "," "," "," "," "," "," "," "," "," "," "," "," "," "," "," "," "," "," "," "," "," "," "," "," "," "," "," "," "," "," "," "]
{"$rows_left_out":686}